{"text_format":"1","workbook":"xlsx","n_sheets":5,"sheets":["Spring_Home","X_Spring","SpringCalculation","Date","Matrix"],"not_rendered":{"charts":0,"images":8,"macros":1,"external_links":0,"defined_names":39,"comments":1,"pivot_tables":0},"unopened":[],"bounds":{"document_bytes":16777216,"sheet_cells":100000,"rows_first":2000,"rows_last":500,"rows_between":2000,"halvings":0,"cell_chars":16384,"cell_head_chars":4096},"cells_cut":0,"cells_raw":0,"read":"whole","date_system":"1900"}

{"sheet":"Spring_Home","index":0,"n_rows":39,"n_cols":11,"rows_kept":39,"cut":false,"hidden":false,"merged":[[1,0,1,8]]}
[]
["Spring selection HOME"]
[]
[]
[null,null,"DW",2400,"[mm]",{"$f":"IF(Date!$B$7>Date!B7,Date!B9,\"\")","v":""}]
[null,null,"DH",2000,"[mm]",{"$f":"IF(Date!$B$7>365,Date!B10,\"\")","v":""}]
[null,null,"KG",125,"[kg]",{"$f":"IF(Date!$B$7>365,Date!B11,\"\")","v":""}]
[]
[]
[null,null,"Spring Home-X extension spring"]
[]
[null,null,null,"Art.nb:","Description"]
[null,null,null,{"$f":"IF(AND(KG<=130,DH<3001,DW<5501),VeerX,NOSP)","v":115510},{"$f":"X_Spring!T1","v":"HOME-X Spring SET L=650, 1875_2000 (2,1 / 3,4 / 4,3)"}]
[null,null,null,{"$f":"IF(AND(KG<=130,DH<3001,DW<5501),KabelX,\"-\")","v":"115211-2000"},{"$f":"IF(AND(KG<=130,DH<3001,DW<5501),X_Spring!Q27,\"-\")","v":"HOME Cable set 2 mm for doorheight 2000 mm"}]
[]
[]
[]
[null,null,"Home-F & R torsion spring",null,null,null,null,null,null,null,{"$f":"\"Build-in information \"&SpringCalculation!SC_RESULT_QTY&\" Springs.\"","v":"Build-in information 2 Springs."}]
[]
[null,null,"Lifetime",15000]
[]
[null,null,null,"Art.nb:","Qty set","Turns","Lifetime"]
[null,null,null,{"$f":"SC_RESULT_ITEM","v":3296508382},{"$f":"SpringCalculation!SC_RESULT_QTY/2","v":1},{"$f":"SpringCalculation!SC_RESULT_RST","v":6.8},{"$f":"SpringCalculation!SC_RESULT_ELT","v":26667}]
[]
[null,null,null,"Other solutions"]
[null,1,null,{"$f":"IF($B26>SC_RESULT_MAX,\"\",SpringCalculation!T3)","v":3296508382},{"$f":"IF($B26>SC_RESULT_MAX,\"\",SpringCalculation!U3/2)","v":1},{"$f":"IF($B26>SC_RESULT_MAX,\"\",SpringCalculation!V3)","v":6.8195790220146231},{"$f":"IF($B26>SC_RESULT_MAX,\"\",SpringCalculation!W3)","v":26667}]
[null,{"$f":"B26+1","v":2},null,{"$f":"IF($B27>SC_RESULT_MAX,\"\",SpringCalculation!T4)","v":3296509132},{"$f":"IF($B27>SC_RESULT_MAX,\"\",SpringCalculation!U4/2)","v":1},{"$f":"IF($B27>SC_RESULT_MAX,\"\",SpringCalculation!V4)","v":6.9265098683867485},{"$f":"IF($B27>SC_RESULT_MAX,\"\",SpringCalculation!W4)","v":38250}]
[null,{"$f":"B27+1","v":3},null,{"$f":"IF($B28>SC_RESULT_MAX,\"\",SpringCalculation!T5)","v":""},{"$f":"IF($B28>SC_RESULT_MAX,\"\",SpringCalculation!U5/2)","v":""},{"$f":"IF($B28>SC_RESULT_MAX,\"\",SpringCalculation!V5)","v":""},{"$f":"IF($B28>SC_RESULT_MAX,\"\",SpringCalculation!W5)","v":""}]
[null,4,null,{"$f":"IF($B29>SC_RESULT_MAX,\"\",SpringCalculation!T6)","v":""},{"$f":"IF($B29>SC_RESULT_MAX,\"\",SpringCalculation!U6/2)","v":""},{"$f":"IF($B29>SC_RESULT_MAX,\"\",SpringCalculation!V6)","v":""},{"$f":"IF($B29>SC_RESULT_MAX,\"\",SpringCalculation!W6)","v":""}]
[null,5,null,{"$f":"IF($B30>SC_RESULT_MAX,\"\",SpringCalculation!T7)","v":""},{"$f":"IF($B30>SC_RESULT_MAX,\"\",SpringCalculation!U7/2)","v":""},{"$f":"IF($B30>SC_RESULT_MAX,\"\",SpringCalculation!V7)","v":""},{"$f":"IF($B30>SC_RESULT_MAX,\"\",SpringCalculation!W7)","v":""}]
[null,6,null,{"$f":"IF($B31>SC_RESULT_MAX,\"\",SpringCalculation!T8)","v":""},{"$f":"IF($B31>SC_RESULT_MAX,\"\",SpringCalculation!U8/2)","v":""},{"$f":"IF($B31>SC_RESULT_MAX,\"\",SpringCalculation!V8)","v":""},{"$f":"IF($B31>SC_RESULT_MAX,\"\",SpringCalculation!W8)","v":""}]
[null,7,null,{"$f":"IF($B32>SC_RESULT_MAX,\"\",SpringCalculation!T9)","v":""},{"$f":"IF($B32>SC_RESULT_MAX,\"\",SpringCalculation!U9/2)","v":""},{"$f":"IF($B32>SC_RESULT_MAX,\"\",SpringCalculation!V9)","v":""},{"$f":"IF($B32>SC_RESULT_MAX,\"\",SpringCalculation!W9)","v":""}]
[null,8,null,{"$f":"IF($B33>SC_RESULT_MAX,\"\",SpringCalculation!T10)","v":""},{"$f":"IF($B33>SC_RESULT_MAX,\"\",SpringCalculation!U10/2)","v":""},{"$f":"IF($B33>SC_RESULT_MAX,\"\",SpringCalculation!V10)","v":""},{"$f":"IF($B33>SC_RESULT_MAX,\"\",SpringCalculation!W10)","v":""}]
[null,9,null,{"$f":"IF($B34>SC_RESULT_MAX,\"\",SpringCalculation!T11)","v":""},{"$f":"IF($B34>SC_RESULT_MAX,\"\",SpringCalculation!U11/2)","v":""},{"$f":"IF($B34>SC_RESULT_MAX,\"\",SpringCalculation!V11)","v":""},{"$f":"IF($B34>SC_RESULT_MAX,\"\",SpringCalculation!W11)","v":""}]
[null,10,null,{"$f":"IF($B35>SC_RESULT_MAX,\"\",SpringCalculation!T12)","v":""},{"$f":"IF($B35>SC_RESULT_MAX,\"\",SpringCalculation!U12/2)","v":""},{"$f":"IF($B35>SC_RESULT_MAX,\"\",SpringCalculation!V12)","v":""},{"$f":"IF($B35>SC_RESULT_MAX,\"\",SpringCalculation!W12)","v":""}]
[null,11,null,{"$f":"IF($B36>SC_RESULT_MAX,\"\",SpringCalculation!T13)","v":""},{"$f":"IF($B36>SC_RESULT_MAX,\"\",SpringCalculation!U13/2)","v":""},{"$f":"IF($B36>SC_RESULT_MAX,\"\",SpringCalculation!V13)","v":""},{"$f":"IF($B36>SC_RESULT_MAX,\"\",SpringCalculation!W13)","v":""}]
[null,12,null,{"$f":"IF($B37>SC_RESULT_MAX,\"\",SpringCalculation!T14)","v":""},{"$f":"IF($B37>SC_RESULT_MAX,\"\",SpringCalculation!U14/2)","v":""},{"$f":"IF($B37>SC_RESULT_MAX,\"\",SpringCalculation!V14)","v":""},{"$f":"IF($B37>SC_RESULT_MAX,\"\",SpringCalculation!W14)","v":""}]
[null,null,null,"Calculated with drum diameter M102"]
[null,null,null,null,null,null,null,null,{"$f":"Date!B13&\" Date: \"&TEXT(Date!B4,\"dd-mmm-jjjj\")","v":"V1.1 Date: 09-feb-2023"}]

{"sheet":"X_Spring","index":1,"n_rows":55,"n_cols":20,"rows_kept":55,"cut":false,"hidden":true,"merged":[]}
["ITEM","F0 [N]","RS [N/mm]","DH,min","DH,max","SELECT,H","KG@DH","RESULT_ID",null,"Input:",null,null,"Vaste gegevens:",null,null,null,null,null,null,{"$f":"_xlfn.IFNA(VLOOKUP(VeerX,S2:T55,2,0),\"-\")","v":"HOME-X Spring SET L=650, 1875_2000 (2,1 / 3,4 / 4,3)"}]
[115501,38,0.37436507451144224,1751,2000,{"$f":"IF(AND((DH-IF(VOETJE=TRUE,8,0))>=D2,(DH-IF(VOETJE=TRUE,8,0))<=E2),1,0)","v":1},{"$f":"(((C2*VEERWEG)+B2)*CORRECTION_FACTOR)/9.81","v":40.637714686829796},{"$f":"IF(AND(F2=1,G2<=KG_MAX),MAX($H1:H1)+1,0)","v":1},null,"DH",{"$f":"DH","v":2000},null,"CORRECTION",1.08,null,null,null,null,115501,"HOME-X Spring SET L=650, 1875_2000 (2,1 / 3,0 / --)"]
[115502,42,0.43678056600096238,1751,2000,1,47.155861720497384,{"$f":"IF(AND(F3=1,G3<=KG_MAX),MAX($H2:H2)+1,0)","v":2},null,"KG",{"$f":"KG","v":125},null,"KG MAX↑",0.05,null,null,null,null,115502,"HOME-X Spring SET L=650, 1875_2000 (2,3 / 3,0 / --)"]
[115503,45,0.47048149750353424,1751,{"$f":"2000","v":2000},1,50.767803802775347,{"$f":"IF(AND(F4=1,G4<=KG_MAX),MAX($H3:H3)+1,0)","v":3},null,"VOETJE",false,null,null,null,null,null,null,null,115503,"HOME-X Spring SET L=650, 1875_2000 (2,1 / 3,2 / --)"]
[115504,49,0.53289698899305438,1751,2000,1,57.285950836442922,{"$f":"IF(AND(F5=1,G5<=KG_MAX),MAX($H4:H4)+1,0)","v":4},null,"VEERWEG",{"$f":"(DH-231)/2","v":884.5},null,"KG_MAX",{"$f":"KG*(1+KG_MAX_FACTOR)","v":131.25},null,null,null,null,115504,"HOME-X Spring SET L=650, 1875_2000 (2,3 / 3,2 / --)"]
[115505,52,0.59806474373261964,1751,{"$f":"2000","v":2000},1,63.962010917229591,{"$f":"IF(AND(F6=1,G6<=KG_MAX),MAX($H5:H5)+1,0)","v":5},null,null,null,null,null,null,null,null,null,null,115505,"HOME-X Spring SET L=650, 1875_2000 (2,1 / 3,4 / --)"]
[115506,56,0.66048023522213983,1751,2000,1,70.48015795089718,{"$f":"IF(AND(F7=1,G7<=KG_MAX),MAX($H6:H6)+1,0)","v":6},null,null,null,null,null,null,null,null,null,null,115506,"HOME-X Spring SET L=650, 1875_2000 (2,3 / 3,4 / --)"]
[115507,69,0.75112253469365575,1751,{"$f":"2000","v":2000},1,80.737748470077634,{"$f":"IF(AND(F8=1,G8<=KG_MAX),MAX($H7:H7)+1,0)","v":7},null,"Resultaat:",null,null,null,null,null,null,null,null,115507,"HOME-X Spring SET L=650, 1875_2000 (-- / 3,4 / 3,8)"]
[115508,76,0.84395488275165553,1751,2000,1,90.548047023174973,{"$f":"IF(AND(F9=1,G9<=KG_MAX),MAX($H8:H8)+1,0)","v":8},null,"RESULT_ID",{"$f":"MAX(H2:H54)","v":10},null,null,null,null,null,null,null,115508,"HOME-X Spring SET L=650, 1875_2000 (-- / 3,4 / 4,0)"]
[115509,85,0.98942373576900033,1751,{"$f":"2000","v":2000},1,105.70406909589147,{"$f":"IF(AND(F10=1,G10<=KG_MAX),MAX($H9:H9)+1,0)","v":9},null,"SPRING",{"$f":"IF(KG>130,\"NO SPRING!\",IF(RESULT_ID>0,INDEX(A2:A54,MATCH(RESULT_ID,H2:H54,0)),\"NO SPRING!\"))","v":115510},null,null,null,null,null,null,null,115509,"HOME-X Spring SET L=650, 1875_2000 (-- / 3,4 / 4,3)"]
[115510,99,1.1290404318098006,1751,2000,1,120.84068938742409,{"$f":"IF(AND(F11=1,G11<=KG_MAX),MAX($H10:H10)+1,0)","v":10},null,null,null,null,null,null,null,null,null,null,115510,"HOME-X Spring SET L=650, 1875_2000 (2,1 / 3,4 / 4,3)"]
[115511,110,1.3219052912040483,1751,{"$f":"2000","v":2000},1,140.83213542054833,{"$f":"IF(AND(F12=1,G12<=KG_MAX),MAX($H11:H11)+1,0)","v":0},null,null,null,null,null,null,null,null,null,null,115511,"HOME-X Spring SET L=650, 1875_2000 (2,1 / 3,4 / 4,5)"]
[115521,36,0.32076735213339408,2001,2250,0,35.198391518750867,{"$f":"IF(AND(F13=1,G13<=KG_MAX),MAX($H12:H12)+1,0)","v":0},null,"opmerkingen",null,null,null,null,null,null,null,null,115521,"HOME-X Spring SET L=735, 2125_2250 (2,3 / 2,8 / --)"]
[115522,41,0.36262232639019903,2001,2250,0,39.824526351427266,{"$f":"IF(AND(F14=1,G14<=KG_MAX),MAX($H13:H13)+1,0)","v":0},null,{"$f":"B1","v":"F0 [N]"},"Vaste waarde. Eigenschappen van samengestelde veer",null,null,null,null,null,null,null,115522,"HOME-X Spring SET L=735, 2125_2250 (1,9 / 3,2 / --)"]
[115523,45,0.41356240782291931,2001,2250,0,45.225242170940049,{"$f":"IF(AND(F15=1,G15<=KG_MAX),MAX($H14:H14)+1,0)","v":0},null,{"$f":"C1","v":"RS [N/mm]"},"Vaste waarde. Eigenschappen van samengestelde veer",null,null,null,null,null,null,null,115523,"HOME-X Spring SET L=735 (42-48_45-51)"]
[115524,48,0.47366548013596455,2001,2250,0,51.408122992322269,{"$f":"IF(AND(F16=1,G16<=KG_MAX),MAX($H15:H15)+1,0)","v":0},null,{"$f":"F1","v":"SELECT,H"},"Keuze van het hoogte bereik. Het kunststof voetje heeft hier invloed op.",null,null,null,null,null,null,null,115524,"HOME-X Spring SET L=735, 2125_2250 (1,9 / 3,4 / --)"]
[115525,52,0.52460556156868476,2001,2250,0,56.808838811835045,{"$f":"IF(AND(F17=1,G17<=KG_MAX),MAX($H16:H16)+1,0)","v":0},null,null,"Door het voetje verschuift je bereik 8mm",null,null,null,null,null,null,null,115525,"HOME-X Spring SET L=735, 2125_2250 (2,1 / 3,4 / --)"]
[115526,56,0.57978267014220508,2001,2250,0,62.622140008159306,{"$f":"IF(AND(F18=1,G18<=KG_MAX),MAX($H17:H17)+1,0)","v":0},null,{"$f":"G1","v":"KG@DH"},{"$f":"_xlfn.FORMULATEXT(G2)","v":"=(((C2*VEERWEG)+B2)*CORRECTION_FACTOR)/9,81"},null,null,null,null,null,null,null,115526,"HOME-X Spring SET L=735, 2125_2250 (2,3 / 3,4 / --)"]
[115527,69,0.65759055084958584,2001,2250,0,71.629964281811965,{"$f":"IF(AND(F19=1,G19<=KG_MAX),MAX($H18:H18)+1,0)","v":0},null,{"$f":"H1","v":"RESULT_ID"},"Keuze op basis van het gewicht mits het in het hoogte bereik valt.",null,null,null,null,null,null,null,115527,"HOME-X Spring SET L=735, 2125_2250 (-- / 3,4 / 3,8)"]
[115528,78,0.75400174721771673,2001,2250,0,82.00894077953069,{"$f":"IF(AND(F20=1,G20<=KG_MAX),MAX($H19:H19)+1,0)","v":0},null,null,"Max waarde is RESULT_ID. Als KG>130 dan geen veer",null,null,null,null,null,null,null,115527,"HOME-X Spring SET L=735, 2125_2250 (-- / 3,4 / 3,8)"]
[115529,85,0.86504490096348219,2001,2250,0,93.592537420425685,{"$f":"IF(AND(F21=1,G21<=KG_MAX),MAX($H20:H20)+1,0)","v":0},null,null,null,null,null,null,null,null,null,null,115528,"HOME-X Spring SET L=735, 2125_2250 (-- / 3,2 / 4,3)"]
[115530,99,0.98794103460418681,2001,2250,0,107.10097377329211,{"$f":"IF(AND(F22=1,G22<=KG_MAX),MAX($H21:H21)+1,0)","v":0},null,null,null,null,null,null,null,null,null,null,115529,"HOME-X Spring SET L=735, 2125_2250 (-- / 3,4 / 4,3)"]
[115531,108,1.1271466784989204,2001,2250,0,121.64710867511505,{"$f":"IF(AND(F23=1,G23<=KG_MAX),MAX($H22:H22)+1,0)","v":0},null,null,null,null,null,null,null,null,null,null,115530,"HOME-X Spring SET L=735, 2125_2250 (2,1 / 3,4 / 4,3)"]
[115541,41,0.3222367449861821,2251,2500,0,35.891934048470979,{"$f":"IF(AND(F24=1,G24<=KG_MAX),MAX($H23:H23)+1,0)","v":0},null,null,null,null,null,null,null,null,null,null,115531,"HOME-X Spring SET L=735, 2125_2250 (2,0 / 3,4 / 4,5)"]
[115542,45,0.36756149249679232,2251,2500,0,40.745850287715172,{"$f":"IF(AND(F25=1,G25<=KG_MAX),MAX($H24:H24)+1,0)","v":0},null,null,null,null,null,null,null,null,null,null,115541,"HOME-X Spring SET L=820, 2375_2500 (1,9 / 3,2 / --)"]
[115543,48,0.42160304368957113,2251,2500,0,46.338483538725761,{"$f":"IF(AND(F26=1,G26<=KG_MAX),MAX($H25:H25)+1,0)","v":0},null,null,null,null,null,"KabelX",null,null,null,null,115542,"HOME-X Spring SET L=820, 2375_2500 (2,1 / 3,2 / --)"]
[115544,52,0.46692779120018135,2251,2500,0,51.192399777969953,{"$f":"IF(AND(F27=1,G27<=KG_MAX),MAX($H26:H26)+1,0)","v":0},null,null,null,null,null,{"$f":"_xlfn.IFNA(VLOOKUP(1,M28:P37,4,0),\"-\")","v":"115211-2000"},null,"Cable SET",{"$f":"_xlfn.IFNA(VLOOKUP(KabelX,P28:Q37,2,0),\"-\")","v":"HOME Cable set 2 mm for doorheight 2000 mm"},null,115543,"HOME-X Spring SET L=820, 2375_2500 (1,9 / 3,4 / --)"]
[115545,62,0.48540756884791642,2251,2500,0,54.092806750016372,{"$f":"IF(AND(F28=1,G28<=KG_MAX),MAX($H27:H27)+1,0)","v":0},null,null,null,null,{"$f":"IF(AND(DH-IF(VOETJE=TRUE,8,0)>=N28,DH-IF(VOETJE=TRUE,8,0)<=O28),1,0)","v":0},{"$f":"O28-124","v":1751},1875,"115211-1875","HOME Cable set 2 mm for doorheight 1875 mm",null,115544,"HOME-X Spring SET L=820, 2375_2500 (2,1 / 3,4 / --)"]
[115546,69,0.55543440218206153,2251,2500,0,61.682392153765143,{"$f":"IF(AND(F29=1,G29<=KG_MAX),MAX($H28:H28)+1,0)","v":0},null,null,null,null,{"$f":"IF(AND(DH-IF(VOETJE=TRUE,8,0)>=N29,DH-IF(VOETJE=TRUE,8,0)<=O29),1,0)","v":1},1876,2000,"115211-2000","HOME Cable set 2 mm for doorheight 2000 mm",null,115545,"HOME-X Spring SET L=820, 2375_2500 (-- / 3,2 / 3,8)"]
[115547,69,0.58477386755130545,2251,2500,0,64.539356240271161,{"$f":"IF(AND(F30=1,G30<=KG_MAX),MAX($H29:H29)+1,0)","v":0},null,null,null,null,0,2001,2125,"115211-2125","HOME Cable set 2 mm for doorheight 2125 mm",null,115546,"HOME-X Spring SET L=820, 2375_2500 (-- / 3,2 / 4,0)"]
[115548,78,0.66908318509783193,2251,2500,0,73.739898409434758,{"$f":"IF(AND(F31=1,G31<=KG_MAX),MAX($H30:H30)+1,0)","v":0},null,null,null,null,0,2126,2250,"115211-2250","HOME Cable set 2 mm for doorheight 2250 mm",null,115547,"HOME-X Spring SET L=820, 2375_2500 (-- / 3,4 / 3,8)"]
[115549,85,0.76844948380122102,2251,2500,0,84.18644789968954,{"$f":"IF(AND(F32=1,G32<=KG_MAX),MAX($H31:H31)+1,0)","v":0},null,null,null,null,0,2251,2375,"115211-2375","HOME Cable set 2 mm for doorheight 2375 mm",null,115548,"HOME-X Spring SET L=820, 2375_2500 (-- / 3,2 / 4,3)"]
[115550,99,0.87790897349720853,2251,2500,0,96.386475639443773,{"$f":"IF(AND(F33=1,G33<=KG_MAX),MAX($H32:H32)+1,0)","v":0},null,null,null,null,0,2376,2500,"115211-2500","HOME Cable set 2 mm for doorheight 2500 mm",null,115549,"HOME-X Spring SET L=820, 2375_2500 (-- / 3,4 / 4,3)"]
[115551,108,1.0008089231009465,2251,2500,{"$f":"IF(AND((DH-IF(VOETJE=TRUE,8,0))>=D34,(DH-IF(VOETJE=TRUE,8,0))<=E34),1,0)","v":0},{"$f":"(((C34*VEERWEG)+B34)*CORRECTION_FACTOR)/9.81","v":109.34482486049033},{"$f":"IF(AND(F34=1,G34<=KG_MAX),MAX($H33:H33)+1,0)","v":0},null,null,null,null,0,2501,2625,"115211-2625","HOME Cable set 2 mm for doorheight 2625 mm",null,115550,"HOME-X Spring SET L=820, 2375_2500 (2,1 / 3,4 / 4,3)"]
[115561,43,0.30906316424261154,2501,2750,0,34.829325002486961,{"$f":"IF(AND(F35=1,G35<=KG_MAX),MAX($H34:H34)+1,0)","v":0},null,null,null,null,0,2626,2750,"115211-2750","HOME Cable set 2 mm for doorheight 2750 mm",null,115551,"HOME-X Spring SET L=820, 2375_2500 (2,0 / 3,4 / 4,5)"]
[115562,45,0.3318776518743129,2501,2750,0,37.27109538526566,{"$f":"IF(AND(F36=1,G36<=KG_MAX),MAX($H35:H35)+1,0)","v":0},null,null,null,null,0,2751,2875,"115211-2875","HOME Cable set 2 mm for doorheight 2875 mm",null,115561,"HOME-X Spring SET L=905, 2625_2750 (2,0 / 3,2 / --)"]
[115563,49,0.3761613908578656,2501,2750,0,42.023642225370509,{"$f":"IF(AND(F37=1,G37<=KG_MAX),MAX($H36:H36)+1,0)","v":0},null,null,null,null,0,2876,3000,"115211-3000","HOME Cable set 2 mm for doorheight 3000 mm",null,115562,"HOME-X Spring SET L=905, 2625_2750 (2,1 / 3,2 / --)"]
[115564,52,0.42091435379110159,2501,2750,0,46.711788542557365,{"$f":"IF(AND(F38=1,G38<=KG_MAX),MAX($H37:H37)+1,0)","v":0},null,null,null,null,null,null,null,null,null,null,115563,"HOME-X Spring SET L=905, 2625_2750 (2,3 / 3,2 / --)"]
[115565,56,0.46519809277465424,2501,2750,0,51.464335382662206,{"$f":"IF(AND(F39=1,G39<=KG_MAX),MAX($H38:H38)+1,0)","v":0},null,null,null,null,null,null,null,null,null,null,115564,"HOME-X Spring SET L=905, 2625_2750 (2,1 / 3,4 / --)"]
[115566,69,0.52554697867897271,2501,2750,0,58.772070015583644,{"$f":"IF(AND(F40=1,G40<=KG_MAX),MAX($H39:H39)+1,0)","v":0},null,null,null,null,null,null,null,null,null,null,115565,"HOME-X Spring SET L=905, 2625_2750 (2,3 / 3,4 / --)"]
[115567,78,0.60222567883703138,2501,2750,0,67.229572065837161,{"$f":"IF(AND(F41=1,G41<=KG_MAX),MAX($H40:H40)+1,0)","v":0},null,null,null,null,null,null,null,null,null,null,115566,"HOME-X Spring SET L=905, 2625_2750 (-- / 3,4 / 3,8)"]
[115568,85,0.69126238075382007,2501,2750,0,76.670265223128865,{"$f":"IF(AND(F42=1,G42<=KG_MAX),MAX($H41:H41)+1,0)","v":0},null,null,null,null,null,null,null,null,null,null,115567,"HOME-X Spring SET L=905, 2625_2750 (-- / 3,2 / 4,3)"]
[115569,99,0.79017155818995344,2501,2750,0,87.842944207597853,{"$f":"IF(AND(F43=1,G43<=KG_MAX),MAX($H42:H42)+1,0)","v":0},null,null,null,null,null,null,null,null,null,null,115568,"HOME-X Spring SET L=905, 2625_2750 (-- / 3,4 / 4,3)"]
[115570,108,0.90011831037345558,2501,2750,0,99.539960975264748,{"$f":"IF(AND(F44=1,G44<=KG_MAX),MAX($H43:H43)+1,0)","v":0},null,null,null,null,null,null,null,null,null,null,115569,"HOME-X Spring SET L=905, 2625_2750 (2,1 / 3,4 / 4,3)"]
[115581,43,0.28083705295338507,2751,3000,0,32.080775046304858,{"$f":"IF(AND(F45=1,G45<=KG_MAX),MAX($H44:H44)+1,0)","v":0},null,null,null,null,null,null,null,null,null,null,115570,"HOME-X Spring SET L=905, 2625_2750 (2,0 / 3,4 / 4,5)"]
[115582,45,0.30158943816967915,2751,3000,0,34.321745841586917,{"$f":"IF(AND(F46=1,G46<=KG_MAX),MAX($H45:H45)+1,0)","v":0},null,null,null,null,null,null,null,null,null,null,115581,"HOME-X Spring SET L=990, 2875_3000 (2,0 / 3,2 / --)"]
[115583,49,0.34199324982732776,2751,3000,0,38.696480308873916,{"$f":"IF(AND(F47=1,G47<=KG_MAX),MAX($H46:H46)+1,0)","v":0},null,null,null,null,null,null,null,null,null,null,115582,"HOME-X Spring SET L=990, 2875_3000 (2,1 / 3,2 / --)"]
[115584,52,0.3829593650442778,2751,3000,0,43.01587798697215,{"$f":"IF(AND(F48=1,G48<=KG_MAX),MAX($H47:H47)+1,0)","v":0},null,null,null,null,null,null,null,null,null,null,115583,"HOME-X Spring SET L=990, 2875_3000 (2,3 / 3,2 / --)"]
[115585,56,0.42336317670192641,2751,3000,0,47.390612454259141,{"$f":"IF(AND(F49=1,G49<=KG_MAX),MAX($H48:H48)+1,0)","v":0},null,null,null,null,null,null,null,null,null,null,115584,"HOME-X Spring SET L=990, 2875_3000 (2,1 / 3,4 / --)"]
[115586,69,0.47798133944649313,2751,3000,0,54.140311347569522,{"$f":"IF(AND(F50=1,G50<=KG_MAX),MAX($H49:H49)+1,0)","v":0},null,null,null,null,null,null,null,null,null,null,115585,"HOME-X Spring SET L=990, 2875_3000 (2,3 / 3,4 / --)"]
[115587,78,0.54679769279360457,2751,3000,0,61.832208360654313,{"$f":"IF(AND(F51=1,G51<=KG_MAX),MAX($H50:H50)+1,0)","v":0},null,null,null,null,null,null,null,null,null,null,115586,"HOME-X Spring SET L=990, 2875_3000 (-- / 3,4 / 3,8)"]
[115588,85,0.62816761966820323,2751,3000,0,70.526340506039531,{"$f":"IF(AND(F52=1,G52<=KG_MAX),MAX($H51:H51)+1,0)","v":0},null,null,null,null,null,null,null,null,null,null,115587,"HOME-X Spring SET L=990, 2875_3000 (-- / 3,2 / 4,3)"]
[115589,99,0.71818364737871931,2751,3000,0,80.833038837410342,{"$f":"IF(AND(F53=1,G53<=KG_MAX),MAX($H52:H52)+1,0)","v":0},null,null,null,null,null,null,null,null,null,null,115588,"HOME-X Spring SET L=990, 2875_3000 (-- / 3,4 / 4,3)"]
[115590,108,0.81769688531000462,2751,3000,0,91.514080189728347,{"$f":"IF(AND(F54=1,G54<=KG_MAX),MAX($H53:H53)+1,0)","v":0},null,null,null,null,null,null,null,null,null,null,115589,"HOME-X Spring SET L=990, 2875_3000 (2,1 / 3,4 / 4,3)"]
[null,null,null,null,null,null,null,null,null,null,null,null,null,null,null,null,null,null,115590,"HOME-X Spring SET L=990, 2875_3000 (2,0 / 3,4 / 4,5)"]

{"sheet":"SpringCalculation","index":2,"n_rows":262,"n_cols":29,"rows_kept":262,"cut":false,"hidden":true,"merged":[]}
[]
[null,"DH",{"$f":"DH","v":2000},"mm",null,"Cable",3,"mm",null,"DRUM","HMA","LMA","REV_S",null,"Di","inactive","art nb",null,"RESULTS","ITEM","QTY","RST","ELT","MIN DW","ZAGEN","MASS"]
[null,null,null,null,null,null,null,null,null,"M76",{"$f":"1.5*25.4","v":38.099999999999994},{"$f":"1.5*25.4","v":38.099999999999994},0,null,50.8,8,329,null,1,{"$f":"_xlfn.IFNA(INDEX(SC_TABLE,MATCH($S3,$W$26:$W$155,0),MATCH(T$2,$B$25:$V$25,0)),NOSP)","v":3296508382},{"$f":"_xlfn.IFNA(INDEX(SC_TABLE,MATCH($S3,$W$26:$W$155,0),MATCH(U$2,$B$25:$V$25,0)),0)","v":2},6.8195790220146231,{"$f":"_xlfn.IFNA(INDEX(SC_TABLE,MATCH($S3,$W$26:$W$155,0),MATCH(W$2,$B$25:$V$25,0)),\"\")","v":26667},{"$f":"_xlfn.IFNA(INDEX(SC_TABLE,MATCH($S3,$W$26:$W$155,0),MATCH(X$2,$B$25:$V$25,0)),0)","v":2138.6545272861904},"Center",11.996916569449523,0,0,0]
[null,"DW",{"$f":"DW","v":2400},"mm",null,"Drum","M102","[-]",null,"M102",{"$f":"2.1875*25.4","v":55.5625},{"$f":"2*25.4","v":50.8},0.75,null,66.674999999999997,7,339,null,2,{"$f":"_xlfn.IFNA(INDEX(SC_TABLE,MATCH($S4,$W$26:$W$155,0),MATCH(T$2,$B$25:$V$25,0)),\"\")","v":3296509132},2,6.9265098683867485,38250,2290.044628289028,"No cut",13.079019687559821,0,0,0]
[null,null,null,null,null,"HMA",{"$f":"INDEX($K$3:$M$4,MATCH($G$4,$J$3:$J$4,0),MATCH($F5,$K$2:$M$2,0))+($G$2/2)","v":57.0625},"mm",null,null,null,null,null,null,null,null,null,null,3,"",0,0,"",0,0,0,0,0,0]
[null,"Weight",{"$f":"KG","v":125},"KG",null,"LMA",{"$f":"INDEX($K$3:$M$4,MATCH($G$4,$J$3:$J$4,0),MATCH($F6,$K$2:$M$2,0))+($G$2/2)","v":52.3},"mm",null,null,null,null,null,null,"draad","Rm",null,null,4,"",0,0,"",0,0,0,0,0,0]
[null,null,null,null,null,"REV_S",{"$f":"INDEX($K$3:$M$4,MATCH($G$4,$J$3:$J$4,0),MATCH($F7,$K$2:$M$2,0))","v":0.75},"rev",null,null,null,null,null,null,5,1660,null,null,5,"",0,0,"",0,0,0,0,0,0]
[null,"Lifetime",{"$f":"O15/1.5","v":10000},"cycles",null,"CCSP",{"$f":"PI()*(G6+G5)*G7","v":257.67931993366034},"mm",null,"SBD-DW",87,"mm",null,null,5.3,1640,null,null,6,"",0,0,"",0,0,0,0,0,0]
[null,null,null,null,null,"CIRF",{"$f":"PI()*G6*2","v":328.61059156549231},"mm",null,"Veerkop",50,"mm/veer",null,null,5.5,1630,null,null,7,"",0,0,"",0,0,0,0,0,0]
[null,"ODW",{"$f":"(303/SC_DH)*SC_W","v":18.9375},"KG",null,null,null,null,null,"4veren beugel",116,"mm",null,null,6,1590,null,null,8,"",0,0,"",0,0,0,0,0,0]
[null,"HMT",{"$f":"SC_W*9.81*G5","v":69972.890625},"Nmm",null,"DH_not_active",113,"mm",null,"extra ruimte",50,"mm/veer",null,null,6.5,1560,null,null,9,"",0,0,"",0,0,0,0,0,0]
[null,"LMT",{"$f":"C10*9.81*G6","v":9716.1305625000005},"Nmm",null,null,null,null,null,null,null,null,null,null,7,1540,null,null,10,"",0,0,"",0,0,0,0,0,0]
[null,null,null,null,null,"SBD torque",{"$f":"21*46.7","v":980.7},"Nmm",null,"No cut",0,"mm",null,null,7.5,1510,null,null,11,"",0,0,"",{"$f":"_xlfn.IFNA(INDEX(SC_TABLE,MATCH($S13,$W$26:$W$155,0),MATCH(X$2,$B$25:$V$25,0)),0)","v":0},0,0,0,0,0]
[null,null,null,null,null,"tol. +",0.75,"turns",null,"Center",150,"mm",null,null,null,null,null,null,12,"",0,0,"",0,0,0,0,0,0]
[null,"RDT",{"$f":"((SC_DH-G8-G11)/G9)+G7","v":5.7082110920536628},"turns",null,"tol. -",0,"turns",null,"Ex_Center",490,"mm",null,"Min. lifetime Step 1",{"$f":"Lifetime","v":15000},"if > …",null,null,13,"",0,0,"",0,0,0,0,0,0]
[null,null,null,null,null,null,null,null,null,null,null,null,null,"Min. lifetime Step 2",{"$f":"O15/1.2","v":12500},"elseif > … else > \"C8\"",null,null,14,"",0,0,"",0,0,0,0,0,0]
[null,"Results",{"$f":"MAX(W26:W155)","v":2},null,null,"No Cut DW",3000,null,null,null,null,null,null,"SELECTED RESULT:",{"$f":"IF(MAX(W3:W22)>=O15,INDEX(T3:T22,MIN(IF(W3:W22>=O15,ROW(W3:W22)-2,\"\"))),IF(MAX(W3:W22)>=O16,INDEX(T3:T22,MIN(IF(W3:W22>=O16,ROW(W3:W22)-2,\"\"))),T3))","v":3296508382},null,{"$f":"SC_RESULT_ITEM&\" (\"&SC_RESULT_QTY&\")\"","v":"3296508382 (2)"},null,15,"",0,0,"",0,0,0,0,0,0]
[null,null,null,null,null,null,null,null,215,null,null,null,null,"SELECTED QTY:",{"$f":"VLOOKUP(SC_RESULT_ITEM,$T$3:$AA$22,2,0)","v":2},null,null,null,16,"",0,0,"",0,0,0,0,0,0]
[null,"Density",10.5,"KG/m²",null,null,null,"No cut",{"$f":"\"L = \"&DW+I18","v":"L = 2615"},null,null,null,null,"SELECTED RST:",{"$f":"IFERROR(ROUND(VLOOKUP(SC_RESULT_ITEM,$T$3:$AA$22,3,0),1),\"\")","v":6.8},null,null,null,17,"",0,0,"",0,0,0,0,0,0]
[null,"Additional",5.5,"KG",null,null,null,"Center",{"$f":"\"L = \"&ROUND((DW+I18)/2,0)&\";L = \"&ROUND((DW+I18)/2,0)","v":"L = 1308;L = 1308"},null,null,null,null,"SELECTED ELT:",{"$f":"VLOOKUP(SC_RESULT_ITEM,$T$3:$AA$22,4,0)","v":26667},null,null,null,18,"",0,0,"",0,0,0,0,0,0]
[null,"endcap",{"$f":"2*0.768","v":1.536},"KG/mtr",null,null,null,"Ex_Center",{"$f":"\"L = \"&ROUND((DW+I18)/2,0)-200&\";L = \"&ROUND((DW+I18)/2,0)+200","v":"L = 1108;L = 1508"},null,null,null,null,"SELECTED min DW:",{"$f":"IFERROR(ROUND(VLOOKUP(SC_RESULT_ITEM,$T$3:$AA$22,5,0),0),\"\")","v":2139},null,null,null,19,"",0,0,"",0,0,0,0,0,0]
[null,"alu/seal",1,"KG/mtr",null,null,null,null,{"$f":"VLOOKUP(SC_RESULT_BUILD,H19:I21,2,0)","v":"L = 2615"},null,null,null,null,"SELECTED BUILD:",{"$f":"IF(DW>SC_NOCUTDW,VLOOKUP(SC_RESULT_ITEM,$T$3:$AA$22,6,0),\"No cut\")","v":"No cut"},null,null,null,20,"",0,0,"",0,0,0,0,0,0]
[null,null,{"$f":"(((SC_DH+20)*(SC_DW+20)*$C$19)/1000000)+$C$20+(SC_DH*$C$21/1000)+((SC_DW+20)*$C$22/1000)","v":62.320200000000007},null,null,null,null,"as zaag instuctie",null,null,null,null,null,"SELECTED MASS:",{"$f":"IFERROR(ROUND(VLOOKUP(SC_RESULT_ITEM,$T$3:$AA$22,7,0),3),\"\")","v":11.997}]
[]
[null,"USE M102","ITEM","D","d","L","nw","nw,act","MF","MB","TPST","MASS","QTY","PRE-TURN","RST","KG-","KG+",null,"ELT","MIN DW","RUIMTE","ZAGEN"]
[null,"X",3295004482,{"$f":"INDEX($O$3:$O$4,MATCH(VALUE(LEFT(C26,3)),$Q$3:$Q$4,0))","v":50.8},{"$f":"VALUE(RIGHT(LEFT(C26,5),2))/10","v":5},{"$f":"VALUE(RIGHT(LEFT(C26,9),4))","v":448},{"$f":"(F26/E26)-1","v":88.6},{"$f":"G26-VLOOKUP(D26,$O$3:$P$4,2,0)","v":80.599999999999994},{"$f":"(($E26^4)*206000*PI())/(32*($D26+$E26))","v":226523.32781680438},{"$f":"((E26^3)*VLOOKUP(E26,$O$7:$P$13,2,0)*PI())/32","v":20371.264863121316},{"$f":"I26/H26","v":2810.4631242779701},{"$f":"((PI()*((E26/2)^2))*(PI()*(D26+E26)))*G26*(7.85/1000000)*M26","v":4.7879249685086567},2,{"$f":"((SC_LMT/M26)+SC_SBD)/K26","v":2.0775100127848232},{"$f":"N26+SC_RDT","v":7.785721104838486},{"$f":"((((O26+SC_TOL_MIN)*K26)-SC_SBD)*M26)/(SC_HMA*9.81)","v":74.674569945499158},{"$f":"((((O26+SC_TOL_PLUS)*K26)-SC_SBD)*M26)/(SC_HMA*9.81)","v":82.205512730558922},{"$f":"IF(AND(SC_W>=P26,SC_W<=Q26),1,0)","v":0},{"$f":"_xlfn.IFNA(VLOOKUP(ROUND(VLOOKUP(ROUND(1-(SC_RDT/O26),2),SC_LT_TABLE,2,0)-(($I26*O26)/($H26*J26)),2),SC_LT_TABLE,3,0),0)","v":10833},{"$f":"((F26+(O26*E26)+$K$9+$K$8+$K$11)*M26)+IF(M26=4,$K$10,0)","v":1347.8572110483849},{"$f":"SC_DW-T26","v":1052.1427889516151},{"$f":"IF(U26>=$K$15,$J$15,IF(U26>=$K$14,$J$14,IF(AND(U26>=$K$13,M26=4),$J$14,IF(U26>=$K$13,$J$13,0))))","v":"Ex_Center"},{"$f":"IF(AND(R26=1,S26>=SC_LT,V26<>0,OR(IF(AND($G$4=$J$4,B26=\"X\"),TRUE,FALSE),IF(AND($G$4=$J$3,A26=\"X\",D26<>$O$4),TRUE,FALSE))),MAX($W$25:W25)+1,0)","v":0}]
[null,"X",3295004902,50.8,5,490,97,89,226523.32781680438,20371.264863121316,2545.2059305258917,5.2418591641686199,2,2.2940247039435397,8.002235795997203,69.264817532463695,76.084974706349286,0,16667,1434.0223579599719,965.97764204002806,{"$f":"IF(U27>=$K$15,$J$15,IF(U27>=$K$14,$J$14,IF(AND(U27>=$K$13,M27=4),$J$14,IF(U27>=$K$13,$J$13,0))))","v":"Ex_Center"},{"$f":"IF(AND(R27=1,S27>=SC_LT,V27<>0,OR(IF(AND($G$4=$J$4,B27=\"X\"),TRUE,FALSE),IF(AND($G$4=$J$3,A27=\"X\",D27<>$O$4),TRUE,FALSE))),MAX($W$25:W26)+1,0)","v":0}]
[null,"X",3295005332,50.8,5,533,105.6,97.6,226523.32781680438,20371.264863121316,2320.935735827914,5.706601316868106,2,2.5156945067965104,8.2239055988501732,64.690968997847605,70.910169699444083,0,23750,1522.2390559885018,877.76094401149817,"Ex_Center",{"$f":"IF(AND(R28=1,S28>=SC_LT,V28<>0,OR(IF(AND($G$4=$J$4,B28=\"X\"),TRUE,FALSE),IF(AND($G$4=$J$3,A28=\"X\",D28<>$O$4),TRUE,FALSE))),MAX($W$25:W27)+1,0)","v":0}]
[null,"X",3295005762,50.8,5,576,114.2,106.2,226523.32781680438,20371.264863121316,2132.9880208738641,6.1713434695675913,2,2.737364309649482,8.4455754017031452,60.857894425523384,66.573468704956682,0,35000,1610.4557540170315,789.5442459829685,"Ex_Center",{"$f":"IF(AND(R29=1,S29>=SC_LT,V29<>0,OR(IF(AND($G$4=$J$4,B29=\"X\"),TRUE,FALSE),IF(AND($G$4=$J$3,A29=\"X\",D29<>$O$4),TRUE,FALSE))),MAX($W$25:W28)+1,0)","v":0}]
[null,"X",3295006192,50.8,5,619,122.8,114.8,226523.32781680438,20371.264863121316,1973.1997196585748,6.6360856222670774,2,2.9590341125024531,8.6672452045561155,57.599113256021262,62.886517336821051,0,53125,1698.6724520455612,701.32754795443884,"Ex_Center",{"$f":"IF(AND(R30=1,S30>=SC_LT,V30<>0,OR(IF(AND($G$4=$J$4,B30=\"X\"),TRUE,FALSE),IF(AND($G$4=$J$3,A30=\"X\",D30<>$O$4),TRUE,FALSE))),MAX($W$25:W29)+1,0)","v":0}]
[null,"X",3295006632,50.8,5,663,131.6,123.6,226523.32781680438,20371.264863121316,1832.7130082265728,7.1116357320060857,2,3.1858590270496792,8.8940701191033416,54.733975781638492,59.644930380957391,0,65625,1788.9407011910334,611.05929880896656,"Ex_Center",{"$f":"IF(AND(R31=1,S31>=SC_LT,V31<>0,OR(IF(AND($G$4=$J$4,B31=\"X\"),TRUE,FALSE),IF(AND($G$4=$J$3,A31=\"X\",D31<>$O$4),TRUE,FALSE))),MAX($W$25:W30)+1,0)","v":0}]
[null,"X",3295305032,50.8,5.3,503,93.905660377358487,85.905660377358487,284451.17487941781,23970.183086284989,3311.2041002875344,5.7325226329304115,2,1.7633359661347907,7.4715470581884533,84.886864907065103,93.759597807742125,0,12500,1459.1983988167976,940.80160118320237,"Ex_Center",{"$f":"IF(AND(R32=1,S32>=SC_LT,V32<>0,OR(IF(AND($G$4=$J$4,B32=\"X\"),TRUE,FALSE),IF(AND($G$4=$J$3,A32=\"X\",D32<>$O$4),TRUE,FALSE))),MAX($W$25:W31)+1,0)","v":0}]
[null,"X",3295305512,50.8,5.3,551,102.9622641509434,94.962264150943398,284451.17487941781,23970.183086284989,2995.4127297057707,6.2853879863173105,2,1.9492356506822759,7.6574467427359387,78.446499973486041,86.473035418902796,0,18333,1557.1689354730011,842.83106452699894,"Ex_Center",{"$f":"IF(AND(R33=1,S33>=SC_LT,V33<>0,OR(IF(AND($G$4=$J$4,B33=\"X\"),TRUE,FALSE),IF(AND($G$4=$J$3,A33=\"X\",D33<>$O$4),TRUE,FALSE))),MAX($W$25:W32)+1,0)","v":0}]
[null,"X",3295306002,50.8,5.3,600,112.20754716981132,104.20754716981132,284451.17487941781,23970.183086284989,2729.6600160436619,6.8497713678997707,2,2.1390082453245003,7.8472193373781636,73.026641745821863,80.341063780365133,0,28333,1657.1805249762085,742.81947502379148,"Ex_Center",{"$f":"IF(AND(R34=1,S34>=SC_LT,V34<>0,OR(IF(AND($G$4=$J$4,B34=\"X\"),TRUE,FALSE),IF(AND($G$4=$J$3,A34=\"X\",D34<>$O$4),TRUE,FALSE))),MAX($W$25:W33)+1,0)","v":0}]
[null,"X",3295306492,50.8,5.3,649,121.45283018867924,113.45283018867924,284451.17487941781,23970.183086284989,2507.2197353416173,7.41415474948223,2,2.3287808399667242,8.0369919320203866,68.490113147811897,75.208482164406362,0,41500,1757.192114479416,642.80788552058402,"Ex_Center",{"$f":"IF(AND(R35=1,S35>=SC_LT,V35<>0,OR(IF(AND($G$4=$J$4,B35=\"X\"),TRUE,FALSE),IF(AND($G$4=$J$3,A35=\"X\",D35<>$O$4),TRUE,FALSE))),MAX($W$25:W34)+1,0)","v":0}]
[null,"X",3295306972,50.8,5.3,697,130.50943396226415,122.50943396226415,284451.17487941781,23970.183086284989,2321.8715953502456,7.9670201028691299,2,2.5146805245142096,8.2228916165678729,64.710055259892314,70.931763699255086,0,59375,1855.1626511356194,544.8373488643806,"Ex_Center",{"$f":"IF(AND(R36=1,S36>=SC_LT,V36<>0,OR(IF(AND($G$4=$J$4,B36=\"X\"),TRUE,FALSE),IF(AND($G$4=$J$3,A36=\"X\",D36<>$O$4),TRUE,FALSE))),MAX($W$25:W35)+1,0)","v":0}]
[null,"X",3295307462,50.8,5.3,746,139.75471698113208,131.75471698113208,284451.17487941781,23970.183086284989,2158.9449045695465,8.5314034844515891,2,2.704453119156434,8.412664211210096,61.387268623528506,67.172397206771024,0,75000,1955.1742406388271,444.82575936117291,"Center",{"$f":"IF(AND(R37=1,S37>=SC_LT,V37<>0,OR(IF(AND($G$4=$J$4,B37=\"X\"),TRUE,FALSE),IF(AND($G$4=$J$3,A37=\"X\",D37<>$O$4),TRUE,FALSE))),MAX($W$25:W36)+1,0)","v":0}]
[null,"X",3295307952,50.8,5.3,795,149,141,284451.17487941781,23970.183086284989,2017.3842190029632,9.0957868660340502,2,2.8942257137986585,8.6024368058523208,58.500228127086636,63.906029397899225,0,90625,2055.1858301420343,344.81416985796568,"Center",{"$f":"IF(AND(R38=1,S38>=SC_LT,V38<>0,OR(IF(AND($G$4=$J$4,B38=\"X\"),TRUE,FALSE),IF(AND($G$4=$J$3,A38=\"X\",D38<>$O$4),TRUE,FALSE))),MAX($W$25:W37)+1,0)","v":0}]
[null,"X",3295505412,50.8,5.5,541,97.36363636363636,89.36363636363636,328707.39746922464,26624.138709932282,3678.3126878550065,6.4234739318920102,2,1.5873488136363014,7.2955599056899647,92.373811969075234,102.23025241068825,0,13125,1536.2511589625897,863.74884103741033,"Ex_Center",{"$f":"IF(AND(R39=1,S39>=SC_LT,V39<>0,OR(IF(AND($G$4=$J$4,B39=\"X\"),TRUE,FALSE),IF(AND($G$4=$J$3,A39=\"X\",D39<>$O$4),TRUE,FALSE))),MAX($W$25:W38)+1,0)","v":0}]
[null,"X",3295505932,50.8,5.5,593,106.81818181818181,98.818181818181813,328707.39746922464,26624.138709932282,3326.3858069562752,7.0472286367629424,2,1.7552880573984333,7.4634991494520957,85.196486196212788,94.109900137432291,0,20000,1642.098490643973,757.90150935602696,"Ex_Center",{"$f":"IF(AND(R40=1,S40>=SC_LT,V40<>0,OR(IF(AND($G$4=$J$4,B40=\"X\"),TRUE,FALSE),IF(AND($G$4=$J$3,A40=\"X\",D40<>$O$4),TRUE,FALSE))),MAX($W$25:W39)+1,0)","v":0}]
[null,"X",3295506462,50.8,5.5,646,116.45454545454545,108.45454545454545,328707.39746922464,26624.138709932282,3030.8309909148961,7.6829786244198557,2,1.9264569020021443,7.6346679940558069,79.168832971627722,87.290275514884712,0,30000,1749.981347934614,650.01865206538605,"Ex_Center",{"$f":"IF(AND(R41=1,S41>=SC_LT,V41<>0,OR(IF(AND($G$4=$J$4,B41=\"X\"),TRUE,FALSE),IF(AND($G$4=$J$3,A41=\"X\",D41<>$O$4),TRUE,FALSE))),MAX($W$25:W40)+1,0)","v":0}]
[null,"X",3295506982,50.8,5.5,698,125.90909090909091,117.90909090909091,328707.39746922464,26624.138709932282,2787.8036793843262,8.3067333292907879,2,2.0943961457642759,7.8026072378179387,74.212444922771198,81.682669251302869,0,44750,1855.8286796159973,544.17132038400268,"Ex_Center",{"$f":"IF(AND(R42=1,S42>=SC_LT,V42<>0,OR(IF(AND($G$4=$J$4,B42=\"X\"),TRUE,FALSE),IF(AND($G$4=$J$3,A42=\"X\",D42<>$O$4),TRUE,FALSE))),MAX($W$25:W41)+1,0)","v":0}]
[null,"X",3295507512,50.8,5.5,751,135.54545454545453,127.54545454545453,328707.39746922464,26624.138709932282,2577.1784548549331,8.9424833169476994,2,2.2655649903679871,7.9737760824216499,69.916876909980616,76.822707953534149,0,65625,1963.7115369066382,436.28846309336177,"Center",{"$f":"IF(AND(R43=1,S43>=SC_LT,V43<>0,OR(IF(AND($G$4=$J$4,B43=\"X\"),TRUE,FALSE),IF(AND($G$4=$J$3,A43=\"X\",D43<>$O$4),TRUE,FALSE))),MAX($W$25:W42)+1,0)","v":0}]
[null,"X",3295508042,50.8,5.5,804,145.18181818181819,137.18181818181819,328707.39746922464,26624.138709932282,2396.1440504714851,9.5782333046046144,2,2.4367338349716983,8.1449449270253602,66.224794926819982,72.645524518672588,0,81250,2071.5943941972791,328.40560580272086,"Center",{"$f":"IF(AND(R44=1,S44>=SC_LT,V44<>0,OR(IF(AND($G$4=$J$4,B44=\"X\"),TRUE,FALSE),IF(AND($G$4=$J$3,A44=\"X\",D44<>$O$4),TRUE,FALSE))),MAX($W$25:W43)+1,0)","v":0}]
[null,"X",3295508572,50.8,5.5,857,154.81818181818181,146.81818181818181,328707.39746922464,26624.138709932282,2238.8739146510657,10.213983292261524,2,2.607902679575409,8.3161137716290714,63.017370145164037,69.016677237489489,0,90625,2179.4772514879196,220.5227485120804,"Center",{"$f":"IF(AND(R45=1,S45>=SC_LT,V45<>0,OR(IF(AND($G$4=$J$4,B45=\"X\"),TRUE,FALSE),IF(AND($G$4=$J$3,A45=\"X\",D45<>$O$4),TRUE,FALSE))),MAX($W$25:W44)+1,0)","v":0}]
[null,"X",3296006482,50.8,6,648,107,99,461449.07586090924,33717.143154652455,4661.1017763728205,8.4756696391489719,2,1.2526577537625909,6.960868845816254,112.41717278395043,124.90710388817806,0,15000,1753.5304261497949,646.46957385020505,"Ex_Center",{"$f":"IF(AND(R46=1,S46>=SC_LT,V46<>0,OR(IF(AND($G$4=$J$4,B46=\"X\"),TRUE,FALSE),IF(AND($G$4=$J$3,A46=\"X\",D46<>$O$4),TRUE,FALSE))),MAX($W$25:W45)+1,0)","v":0}]
[null,"X",3296007112,50.8,6,711,117.5,109.5,461449.07586090924,33717.143154652455,4214.1468115151529,9.307394229906583,2,1.3855153943131688,7.0937264863668315,103.30180944373187,114.5940759215267,0,22500,1881.1247178364019,518.87528216359806,"Ex_Center",{"$f":"IF(AND(R47=1,S47>=SC_LT,V47<>0,OR(IF(AND($G$4=$J$4,B47=\"X\"),TRUE,FALSE),IF(AND($G$4=$J$3,A47=\"X\",D47<>$O$4),TRUE,FALSE))),MAX($W$25:W46)+1,0)","v":0}]
[null,"X",3296007752,50.8,6,775,128.16666666666666,120.16666666666666,461449.07586090924,33717.143154652455,3840.0755272752508,10.152320798295266,2,1.5204818863010572,7.2286929783547205,95.6728625942999,105.9627642252447,0,33333,2010.7443157402568,389.25568425974325,"Center",{"$f":"IF(AND(R48=1,S48>=SC_LT,V48<>0,OR(IF(AND($G$4=$J$4,B48=\"X\"),TRUE,FALSE),IF(AND($G$4=$J$3,A48=\"X\",D48<>$O$4),TRUE,FALSE))),MAX($W$25:W47)+1,0)","v":0}]
[null,"X",3296008382,50.8,6,838,138.66666666666666,130.66666666666666,461449.07586090924,33717.143154652455,3531.4980295477749,10.984045389052874,2,1.6533395268516351,7.3615506189052979,89.379620027239156,98.842654562840181,0,53125,2138.3386074268637,261.66139257313625,"Center",{"$f":"IF(AND(R49=1,S49>=SC_LT,V49<>0,OR(IF(AND($G$4=$J$4,B49=\"X\"),TRUE,FALSE),IF(AND($G$4=$J$3,A49=\"X\",D49<>$O$4),TRUE,FALSE))),MAX($W$25:W48)+1,0)","v":0}]
[null,"X",3296009022,50.8,6,902,149.33333333333334,141.33333333333334,461449.07586090924,33717.143154652455,3264.9698763743577,11.828971957441558,2,1.7883060188395239,7.496517110893187,83.943947202021079,92.692790451916366,0,68750,2267.9582053307186,132.04179466928144,"No cut",{"$f":"IF(AND(R50=1,S50>=SC_LT,V50<>0,OR(IF(AND($G$4=$J$4,B50=\"X\"),TRUE,FALSE),IF(AND($G$4=$J$3,A50=\"X\",D50<>$O$4),TRUE,FALSE))),MAX($W$25:W49)+1,0)","v":0}]
[null,"X",3296009662,50.8,6,966,160,152,461449.07586090924,33717.143154652455,3035.8491832954555,12.673898525830239,2,1.9232725108274125,7.6314836028810751,79.271175825956419,87.406065163578361,0,84375,2397.5778032345729,2.4221967654270884,"No cut",{"$f":"IF(AND(R51=1,S51>=SC_LT,V51<>0,OR(IF(AND($G$4=$J$4,B51=\"X\"),TRUE,FALSE),IF(AND($G$4=$J$3,A51=\"X\",D51<>$O$4),TRUE,FALSE))),MAX($W$25:W50)+1,0)","v":0}]
[null,"X",3296010302,50.8,6,1030,170.66666666666666,162.66666666666666,461449.07586090924,33717.143154652455,2836.777105702311,13.518825094218922,2,2.0582390028153008,7.7664500948689632,75.211226925441224,82.812680896661718,0,100000,2527.1974011384277,-127.19740113842772,0,{"$f":"IF(AND(R52=1,S52>=SC_LT,V52<>0,OR(IF(AND($G$4=$J$4,B52=\"X\"),TRUE,FALSE),IF(AND($G$4=$J$3,A52=\"X\",D52<>$O$4),TRUE,FALSE))),MAX($W$25:W51)+1,0)","v":0}]
[null,"X",3296010942,50.8,6,1094,181.33333333333334,173.33333333333334,461449.07586090924,33717.143154652455,2662.2062068898608,14.363751662607607,2,2.1932054948031898,7.9014165868568522,71.650964043450969,78.784636231827122,0,157143,2656.8169990422821,-256.81699904228208,0,{"$f":"IF(AND(R53=1,S53>=SC_LT,V53<>0,OR(IF(AND($G$4=$J$4,B53=\"X\"),TRUE,FALSE),IF(AND($G$4=$J$3,A53=\"X\",D53<>$O$4),TRUE,FALSE))),MAX($W$25:W52)+1,0)","v":0}]
[null,"X",3396008112,66.674999999999997,6,811,134.16666666666666,127.16666666666666,360650.94611489022,33717.143154652455,2836.0493796714827,13.597891691765584,2,2.0587671438662825,7.7669782359199449,75.196385414092873,82.795889363961351,0,100000,2089.2037388310391,310.79626116896088,"Center",{"$f":"IF(AND(R54=1,S54>=SC_LT,V54<>0,OR(IF(AND($G$4=$J$4,B54=\"X\"),TRUE,FALSE),IF(AND($G$4=$J$3,A54=\"X\",D54<>$O$4),TRUE,FALSE))),MAX($W$25:W53)+1,0)","v":0}]
[null,"X",3396008612,66.674999999999997,6,861,142.5,135.5,360650.94611489022,33717.143154652455,2661.6305986338762,14.442481237837983,2,2.1936798007382534,7.9018908927919167,71.639224877746443,78.771354660956334,0,157143,2190.8226907135031,209.17730928649689,"Center",{"$f":"IF(AND(R55=1,S55>=SC_LT,V55<>0,OR(IF(AND($G$4=$J$4,B55=\"X\"),TRUE,FALSE),IF(AND($G$4=$J$3,A55=\"X\",D55<>$O$4),TRUE,FALSE))),MAX($W$25:W54)+1,0)","v":0}]
[null,"X",3396009112,66.674999999999997,6,911,150.83333333333334,143.83333333333334,360650.94611489022,33717.143154652455,2507.4225685855636,15.28707078391038,2,2.3285924576102248,8.0368035496638868,68.494249803317288,75.213162333734047,0,185714,2292.4416425959666,107.55835740403336,"No cut",{"$f":"IF(AND(R56=1,S56>=SC_LT,V56<>0,OR(IF(AND($G$4=$J$4,B56=\"X\"),TRUE,FALSE),IF(AND($G$4=$J$3,A56=\"X\",D56<>$O$4),TRUE,FALSE))),MAX($W$25:W55)+1,0)","v":0}]
[null,"X",3396009612,66.674999999999997,6,961,159.16666666666666,152.16666666666666,360650.94611489022,33717.143154652455,2370.1047937451713,16.131660329982775,2,2.4635051144821962,8.1717162065358586,65.693740783042514,72.044695343556924,0,237500,2394.0605944784302,5.9394055215698245,"No cut",{"$f":"IF(AND(R57=1,S57>=SC_LT,V57<>0,OR(IF(AND($G$4=$J$4,B57=\"X\"),TRUE,FALSE),IF(AND($G$4=$J$3,A57=\"X\",D57<>$O$4),TRUE,FALSE))),MAX($W$25:W56)+1,0)","v":0}]
[null,"X",3296507632,50.8,6.5,763,116.38461538461539,108.38461538461539,630036.80336873792,42059.544271489729,5812.9726357655027,10.914813451339221,2,1.0044370835888341,6.7126481756424967,135.90884919416266,151.48534402624296,0,17500,1987.2644262833523,412.73557371664765,"Center",{"$f":"IF(AND(R58=1,S58>=SC_LT,V58<>0,OR(IF(AND($G$4=$J$4,B58=\"X\"),TRUE,FALSE),IF(AND($G$4=$J$3,A58=\"X\",D58<>$O$4),TRUE,FALSE))),MAX($W$25:W57)+1,0)","v":0}]
[null,"X",3296508382,50.8,6.5,838,127.92307692307693,119.92307692307693,630036.80336873792,42059.544271489729,5253.674434761765,11.996916569449523,2,1.11136792996096,6.8195790220146231,124.50231672773582,138.58011096660761,1,26667,2138.6545272861904,261.34547271380961,"Center",{"$f":"IF(AND(R59=1,S59>=SC_LT,V59<>0,OR(IF(AND($G$4=$J$4,B59=\"X\"),TRUE,FALSE),IF(AND($G$4=$J$3,A59=\"X\",D59<>$O$4),TRUE,FALSE))),MAX($W$25:W58)+1,0)","v":1}]
[null,"X",3296509132,50.8,6.5,913,139.46153846153845,131.46153846153845,630036.80336873792,42059.544271489729,4792.5561403122256,13.079019687559821,2,1.2182987763330855,6.9265098683867485,115.0981012536601,127.94027867811953,1,38250,2290.044628289028,109.95537171097203,"No cut",{"$f":"IF(AND(R60=1,S60>=SC_LT,V60<>0,OR(IF(AND($G$4=$J$4,B60=\"X\"),TRUE,FALSE),IF(AND($G$4=$J$3,A60=\"X\",D60<>$O$4),TRUE,FALSE))),MAX($W$25:W59)+1,0)","v":2}]
[null,"X",3296509892,50.8,6.5,989,151.15384615384616,143.15384615384616,630036.80336873792,42059.544271489729,4401.1168424468524,14.175550847244924,2,1.3266553673235064,7.0348664593771693,107.1149447698314,118.90821785870897,0,56250,2443.4532639719032,-43.453263971903198,0,{"$f":"IF(AND(R61=1,S61>=SC_LT,V61<>0,OR(IF(AND($G$4=$J$4,B61=\"X\"),TRUE,FALSE),IF(AND($G$4=$J$3,A61=\"X\",D61<>$O$4),TRUE,FALSE))),MAX($W$25:W60)+1,0)","v":0}]
[null,"X",3296510642,50.8,6.5,1064,162.69230769230768,154.69230769230768,630036.80336873792,42059.544271489729,4072.8386095443034,15.257653965355221,2,1.4335862136956319,7.1417973057492947,100.41991819026416,111.33353391298974,0,75000,2594.8433649747408,-194.84336497474078,0,{"$f":"IF(AND(R62=1,S62>=SC_LT,V62<>0,OR(IF(AND($G$4=$J$4,B62=\"X\"),TRUE,FALSE),IF(AND($G$4=$J$3,A62=\"X\",D62<>$O$4),TRUE,FALSE))),MAX($W$25:W61)+1,0)","v":0}]
[null,"X",3296511402,50.8,6.5,1140,174.38461538461539,166.38461538461539,630036.80336873792,42059.544271489729,3786.6289615319429,16.354185125040328,2,1.5419428046860528,7.2501538967397154,94.582853747005231,104.72953946979815,0,87500,2748.2520006576165,-348.25200065761646,0,{"$f":"IF(AND(R63=1,S63>=SC_LT,V63<>0,OR(IF(AND($G$4=$J$4,B63=\"X\"),TRUE,FALSE),IF(AND($G$4=$J$3,A63=\"X\",D63<>$O$4),TRUE,FALSE))),MAX($W$25:W62)+1,0)","v":0}]
[null,"X",3296512162,50.8,6.5,1216,186.07692307692307,178.07692307692307,630036.80336873792,42059.544271489729,3538.0036474270382,17.450716284725431,2,1.6502993956764735,7.3585104877301362,89.512297982256371,98.992765031241746,0,100000,2901.6606363404917,-501.66063634049169,0,{"$f":"IF(AND(R64=1,S64>=SC_LT,V64<>0,OR(IF(AND($G$4=$J$4,B64=\"X\"),TRUE,FALSE),IF(AND($G$4=$J$3,A64=\"X\",D64<>$O$4),TRUE,FALSE))),MAX($W$25:W63)+1,0)","v":0}]
[null,"X",3396510182,66.674999999999997,6.5,1018,155.61538461538461,148.61538461538461,493353.04179062089,42059.544271489729,3319.6633246780907,18.637230708062816,2,1.7588426024546293,7.4670536945082926,85.059385429173901,93.954785745175101,0,157143,2507.0716980286079,-107.0716980286079,0,{"$f":"IF(AND(R65=1,S65>=SC_LT,V65<>0,OR(IF(AND($G$4=$J$4,B65=\"X\"),TRUE,FALSE),IF(AND($G$4=$J$3,A65=\"X\",D65<>$O$4),TRUE,FALSE))),MAX($W$25:W64)+1,0)","v":0}]
[null,"X",3396510772,66.674999999999997,6.5,1077,164.69230769230768,157.69230769230768,493353.04179062089,42059.544271489729,3128.5802650136939,19.724325727119375,2,1.8662667365590007,7.5744778286126637,81.16236748787793,89.545739883250775,0,212500,2626.4682117719644,-226.46821177196443,0,{"$f":"IF(AND(R66=1,S66>=SC_LT,V66<>0,OR(IF(AND($G$4=$J$4,B66=\"X\"),TRUE,FALSE),IF(AND($G$4=$J$3,A66=\"X\",D66<>$O$4),TRUE,FALSE))),MAX($W$25:W65)+1,0)","v":0}]
[null,"X",3396511372,66.674999999999997,6.5,1137,173.92307692307693,166.92307692307693,493353.04179062089,42059.544271489729,2955.5712181004938,20.829846085481979,2,1.97551161869904,7.6837227107527024,77.633957585862532,85.553733351076488,0,250000,2747.888395239785,-347.88839523978504,0,{"$f":"IF(AND(R67=1,S67>=SC_LT,V67<>0,OR(IF(AND($G$4=$J$4,B67=\"X\"),TRUE,FALSE),IF(AND($G$4=$J$3,A67=\"X\",D67<>$O$4),TRUE,FALSE))),MAX($W$25:W66)+1,0)","v":0}]
[null,"X",3397008372,{"$f":"INDEX($O$3:$O$4,MATCH(VALUE(LEFT(C68,3)),$Q$3:$Q$4,0))","v":66.674999999999997},{"$f":"VALUE(RIGHT(LEFT(C68,5),2))/10","v":7},{"$f":"VALUE(RIGHT(LEFT(C68,9),4))","v":837},{"$f":"(F68/E68)-1","v":118.57142857142857},{"$f":"G68-VLOOKUP(D68,$O$3:$P$4,2,0)","v":111.57142857142857},{"$f":"(($E68^4)*206000*PI())/(32*($D68+$E68))","v":659081.5134125523},{"$f":"((E68^3)*VLOOKUP(E68,$O$7:$P$13,2,0)*PI())/32","v":51857.877233725019},{"$f":"I68/H68","v":5907.2606835952192},{"$f":"((PI()*((E68/2)^2))*(PI()*(D68+E68)))*G68*(7.85/1000000)*M68","v":16.581953135098953},2,{"$f":"((SC_LMT/M68)+SC_SBD)/K68","v":0.988404879010091},{"$f":"N68+SC_RDT","v":6.6966159710637534},{"$f":"((((O68+SC_TOL_MIN)*K68)-SC_SBD)*M68)/(SC_HMA*9.81)","v":137.83179419351282},{"$f":"((((O68+SC_TOL_PLUS)*K68)-SC_SBD)*M68)/(SC_HMA*9.81)","v":153.66094414402772},{"$f":"IF(AND(SC_W>=P68,SC_W<=Q68),1,0)","v":0},{"$f":"_xlfn.IFNA(VLOOKUP(ROUND(VLOOKUP(ROUND(1-(SC_RDT/O68),2),SC_LT_TABLE,2,0)-(($I68*O68)/($H68*J68)),2),SC_LT_TABLE,3,0),0)","v":50000},{"$f":"((F68+(O68*E68)+$K$9+$K$8+$K$11)*M68)+IF(M68=4,$K$10,0)","v":2141.7526235948926},{"$f":"SC_DW-T68","v":258.24737640510739},{"$f":"IF(U68>=$K$15,$J$15,IF(U68>=$K$14,$J$14,IF(AND(U68>=$K$13,M68=4),$J$14,IF(U68>=$K$13,$J$13,0))))","v":"Center"},{"$f":"IF(AND(R68=1,S68>=SC_LT,V68<>0,OR(IF(AND($G$4=$J$4,B68=\"X\"),TRUE,FALSE),IF(AND($G$4=$J$3,A68=\"X\",D68<>$O$4),TRUE,FALSE))),MAX($W$25:W67)+1,0)","v":0}]
[null,"X",3397009062,66.674999999999997,7,906,128.42857142857142,121.42857142857142,659081.5134125523,51857.877233725019,5427.7301104563139,17.960452853558984,2,1.0757287415602781,6.7839398336139407,128.05207196065578,142.59626738577595,0,65625,2280.9751576705949,119.02484232940515,"No cut",{"$f":"IF(AND(R69=1,S69>=SC_LT,V69<>0,OR(IF(AND($G$4=$J$4,B69=\"X\"),TRUE,FALSE),IF(AND($G$4=$J$3,A69=\"X\",D69<>$O$4),TRUE,FALSE))),MAX($W$25:W68)+1,0)","v":0}]
[null,"X",3397009752,66.674999999999997,7,975,138.28571428571428,131.28571428571428,659081.5134125523,51857.877233725019,5020.2073926962639,19.338952572019018,2,1.1630526041104654,6.871263696164128,119.74090431771629,133.19309812767509,1,78125,2420.197691746298,-20.197691746298005,0,{"$f":"IF(AND(R70=1,S70>=SC_LT,V70<>0,OR(IF(AND($G$4=$J$4,B70=\"X\"),TRUE,FALSE),IF(AND($G$4=$J$3,A70=\"X\",D70<>$O$4),TRUE,FALSE))),MAX($W$25:W69)+1,0)","v":0}]
[null,"X",3397010442,66.674999999999997,7,1044,148.14285714285714,141.14285714285714,659081.5134125523,51857.877233725019,4669.6058642589742,20.717452290479049,2,1.2503764666606527,6.9585875587143153,112.59060826862869,125.10332700481507,1,90625,2559.4202258220002,-159.42022582200025,0,{"$f":"IF(AND(R71=1,S71>=SC_LT,V71<>0,OR(IF(AND($G$4=$J$4,B71=\"X\"),TRUE,FALSE),IF(AND($G$4=$J$3,A71=\"X\",D71<>$O$4),TRUE,FALSE))),MAX($W$25:W70)+1,0)","v":0}]
[null,"X",3397011132,66.674999999999997,7,1113,158,151,659081.5134125523,51857.877233725019,4364.778234520214,22.095952008939086,2,1.3377003292108403,7.0459114212645026,106.37384188347114,118.06974170499636,0,114286,2698.6427598977029,-298.64275989770294,0,{"$f":"IF(AND(R72=1,S72>=SC_LT,V72<>0,OR(IF(AND($G$4=$J$4,B72=\"X\"),TRUE,FALSE),IF(AND($G$4=$J$3,A72=\"X\",D72<>$O$4),TRUE,FALSE))),MAX($W$25:W71)+1,0)","v":0}]
[null,"X",3397011832,66.674999999999997,7,1183,168,161,659081.5134125523,51857.877233725019,4093.6739963512564,23.494429984188393,2,1.4262897549863927,7.134500847040055,100.84484270394498,111.8142891204065,0,171429,2839.8830118585606,-439.88301185856062,0,{"$f":"IF(AND(R73=1,S73>=SC_LT,V73<>0,OR(IF(AND($G$4=$J$4,B73=\"X\"),TRUE,FALSE),IF(AND($G$4=$J$3,A73=\"X\",D73<>$O$4),TRUE,FALSE))),MAX($W$25:W72)+1,0)","v":0}]
[null,"X",3397012522,66.674999999999997,7,1252,177.85714285714286,170.85714285714286,659081.5134125523,51857.877233725019,3857.5004965617609,24.872929702648428,2,1.51361361753658,7.2218247095902424,96.028233803319281,106.36482754190803,0,200000,2979.1055459342633,-579.10554593426332,0,{"$f":"IF(AND(R74=1,S74>=SC_LT,V74<>0,OR(IF(AND($G$4=$J$4,B74=\"X\"),TRUE,FALSE),IF(AND($G$4=$J$3,A74=\"X\",D74<>$O$4),TRUE,FALSE))),MAX($W$25:W73)+1,0)","v":0}]
[null,"X",3295004482,50.8,5,448,88.6,80.599999999999994,226523.32781680438,20371.264863121316,2810.4631242779701,9.5758499370173134,4,1.2132280303449943,6.9214391223986569,131.99218479789863,147.05407036801816,0,15833,2794.4287824479734,-394.42878244797339,0,{"$f":"IF(AND(R75=1,S75>=SC_LT,V75<>0,OR(IF(AND($G$4=$J$4,B75=\"X\"),TRUE,FALSE),IF(AND($G$4=$J$3,A75=\"X\",D75<>$O$4),TRUE,FALSE))),MAX($W$25:W74)+1,0)","v":0}]
[null,"X",3295004902,50.8,5,490,97,89,226523.32781680438,20371.264863121316,2545.2059305258917,10.48371832833724,4,1.339668668743232,7.0478797607968948,121.17267997182772,134.81299431959889,1,22500,2964.957595215938,-564.957595215938,0,{"$f":"IF(AND(R76=1,S76>=SC_LT,V76<>0,OR(IF(AND($G$4=$J$4,B76=\"X\"),TRUE,FALSE),IF(AND($G$4=$J$3,A76=\"X\",D76<>$O$4),TRUE,FALSE))),MAX($W$25:W75)+1,0)","v":0}]
[null,"X",3295005332,50.8,5,533,105.6,97.6,226523.32781680438,20371.264863121316,2320.935735827914,11.413202633736212,4,1.4691197985319036,7.1773308905855666,112.02498290259555,124.46338430578851,0,33333,3139.5466178117113,-739.54661781171126,0,{"$f":"IF(AND(R77=1,S77>=SC_LT,V77<>0,OR(IF(AND($G$4=$J$4,B77=\"X\"),TRUE,FALSE),IF(AND($G$4=$J$3,A77=\"X\",D77<>$O$4),TRUE,FALSE))),MAX($W$25:W76)+1,0)","v":0}]
[null,"X",3295005762,50.8,5,576,114.2,106.2,226523.32781680438,20371.264863121316,2132.9880208738641,12.342686939135183,4,1.5985709283205756,7.3067820203742384,104.35883375794708,115.78998231681369,0,53125,3314.135640407485,-914.13564040748497,0,{"$f":"IF(AND(R78=1,S78>=SC_LT,V78<>0,OR(IF(AND($G$4=$J$4,B78=\"X\"),TRUE,FALSE),IF(AND($G$4=$J$3,A78=\"X\",D78<>$O$4),TRUE,FALSE))),MAX($W$25:W77)+1,0)","v":0}]
[null,"X",3295006192,50.8,5,619,122.8,114.8,226523.32781680438,20371.264863121316,1973.1997196585748,13.272171244534155,4,1.7280220581092474,7.4362331501629102,97.841271418942853,108.41607958054243,0,68750,3488.7246630032582,-1088.7246630032582,0,{"$f":"IF(AND(R79=1,S79>=SC_LT,V79<>0,OR(IF(AND($G$4=$J$4,B79=\"X\"),TRUE,FALSE),IF(AND($G$4=$J$3,A79=\"X\",D79<>$O$4),TRUE,FALSE))),MAX($W$25:W78)+1,0)","v":0}]
[null,"X",3295006632,50.8,5,663,131.6,123.6,226523.32781680438,20371.264863121316,1832.7130082265728,14.223271464012171,4,1.8604836792883535,7.5686947713420167,92.110996470177327,101.93290566881514,0,87500,3667.3738954268401,-1267.3738954268401,0,{"$f":"IF(AND(R80=1,S80>=SC_LT,V80<>0,OR(IF(AND($G$4=$J$4,B80=\"X\"),TRUE,FALSE),IF(AND($G$4=$J$3,A80=\"X\",D80<>$O$4),TRUE,FALSE))),MAX($W$25:W79)+1,0)","v":0}]
[null,"X",3295305032,50.8,5.3,503,93.905660377358487,85.905660377358487,284451.17487941781,23970.183086284989,3311.2041002875344,11.465045265860823,4,1.0297561060427867,6.7379671980964497,152.41677472103055,170.16224052238462,0,17500,3018.8449045996449,-618.84490459964491,0,{"$f":"IF(AND(R81=1,S81>=SC_LT,V81<>0,OR(IF(AND($G$4=$J$4,B81=\"X\"),TRUE,FALSE),IF(AND($G$4=$J$3,A81=\"X\",D81<>$O$4),TRUE,FALSE))),MAX($W$25:W80)+1,0)","v":0}]
[null,"X",3295305512,50.8,5.3,551,102.9622641509434,94.962264150943398,284451.17487941781,23970.183086284989,2995.4127297057707,12.570775972634621,4,1.1383181378680749,6.846529229921738,139.53604485387243,155.58911574470594,0,25000,3213.1464196743409,-813.1464196743409,0,{"$f":"IF(AND(R82=1,S82>=SC_LT,V82<>0,OR(IF(AND($G$4=$J$4,B82=\"X\"),TRUE,FALSE),IF(AND($G$4=$J$3,A82=\"X\",D82<>$O$4),TRUE,FALSE))),MAX($W$25:W81)+1,0)","v":0}]
[null,"X",3295306002,50.8,5.3,600,112.20754716981132,104.20754716981132,284451.17487941781,23970.183086284989,2729.6600160436619,13.699542735799541,4,1.2491418786897235,6.9573529707433863,128.69632839854404,143.32517246763061,0,38250,3411.4958829797597,-1011.4958829797597,0,{"$f":"IF(AND(R83=1,S83>=SC_LT,V83<>0,OR(IF(AND($G$4=$J$4,B83=\"X\"),TRUE,FALSE),IF(AND($G$4=$J$3,A83=\"X\",D83<>$O$4),TRUE,FALSE))),MAX($W$25:W82)+1,0)","v":0}]
[null,"X",3295306492,50.8,5.3,649,121.45283018867924,113.45283018867924,284451.17487941781,23970.183086284989,2507.2197353416173,14.82830949896446,4,1.3599656195113718,7.0681767115650347,119.62327120252414,133.06000923571307,1,56250,3609.8453462851785,-1209.8453462851785,0,{"$f":"IF(AND(R84=1,S84>=SC_LT,V84<>0,OR(IF(AND($G$4=$J$4,B84=\"X\"),TRUE,FALSE),IF(AND($G$4=$J$3,A84=\"X\",D84<>$O$4),TRUE,FALSE))),MAX($W$25:W83)+1,0)","v":0}]
[null,"X",3295306972,50.8,5.3,697,130.50943396226415,122.50943396226415,284451.17487941781,23970.183086284989,2321.8715953502456,15.93404020573826,4,1.4685276513366603,7.1767387433903229,112.06315542668494,124.50657230541053,0,71875,3804.1468613598749,-1404.1468613598749,0,{"$f":"IF(AND(R85=1,S85>=SC_LT,V85<>0,OR(IF(AND($G$4=$J$4,B85=\"X\"),TRUE,FALSE),IF(AND($G$4=$J$3,A85=\"X\",D85<>$O$4),TRUE,FALSE))),MAX($W$25:W84)+1,0)","v":0}]
[null,"X",3295307462,50.8,5.3,746,139.75471698113208,131.75471698113208,284451.17487941781,23970.183086284989,2158.9449045695465,17.062806968903178,4,1.5793513921583089,7.2875624842119713,105.41758215395735,116.98783932044238,0,87500,4002.4963246652937,-1602.4963246652937,0,{"$f":"IF(AND(R86=1,S86>=SC_LT,V86<>0,OR(IF(AND($G$4=$J$4,B86=\"X\"),TRUE,FALSE),IF(AND($G$4=$J$3,A86=\"X\",D86<>$O$4),TRUE,FALSE))),MAX($W$25:W85)+1,0)","v":0}]
[null,"X",3295307952,50.8,5.3,795,149,141,284451.17487941781,23970.183086284989,2017.3842190029632,18.1915737320681,4,1.6901751329799573,7.3983862250336205,99.643501161073615,110.45510370269882,0,100000,4200.845787970713,-1800.845787970713,0,{"$f":"IF(AND(R87=1,S87>=SC_LT,V87<>0,OR(IF(AND($G$4=$J$4,B87=\"X\"),TRUE,FALSE),IF(AND($G$4=$J$3,A87=\"X\",D87<>$O$4),TRUE,FALSE))),MAX($W$25:W86)+1,0)","v":0}]
[null,"X",3295505412,50.8,5.5,541,97.36363636363636,89.36363636363636,328707.39746922464,26624.138709932282,3678.3126878550065,12.84694786378402,4,0.92698281249530545,6.6351939045489683,167.39066884505078,187.10354972827679,0,18333,3173.9742659000772,-773.97426590007717,0,{"$f":"IF(AND(R88=1,S88>=SC_LT,V88<>0,OR(IF(AND($G$4=$J$4,B88=\"X\"),TRUE,FALSE),IF(AND($G$4=$J$3,A88=\"X\",D88<>$O$4),TRUE,FALSE))),MAX($W$25:W87)+1,0)","v":0}]
[null,"X",3295505932,50.8,5.5,593,106.81818181818181,98.818181818181813,328707.39746922464,26624.138709932282,3326.3858069562752,14.094457273525885,4,1.025056273837637,6.7332673658913,153.03601729932595,170.86284518176492,0,28333,3384.1318820496085,-984.13188204960852,0,{"$f":"IF(AND(R89=1,S89>=SC_LT,V89<>0,OR(IF(AND($G$4=$J$4,B89=\"X\"),TRUE,FALSE),IF(AND($G$4=$J$3,A89=\"X\",D89<>$O$4),TRUE,FALSE))),MAX($W$25:W88)+1,0)","v":0}]
[null,"X",3295506462,50.8,5.5,646,116.45454545454545,108.45454545454545,328707.39746922464,26624.138709932282,3030.8309909148961,15.365957248839711,4,1.1250157632827054,6.8332268553363686,140.98071085015579,157.22359593666977,0,41500,3598.3309908174001,-1198.3309908174001,0,{"$f":"IF(AND(R90=1,S90>=SC_LT,V90<>0,OR(IF(AND($G$4=$J$4,B90=\"X\"),TRUE,FALSE),IF(AND($G$4=$J$3,A90=\"X\",D90<>$O$4),TRUE,FALSE))),MAX($W$25:W89)+1,0)","v":0}]
[null,"X",3295506982,50.8,5.5,698,125.90909090909091,117.90909090909091,328707.39746922464,26624.138709932282,2787.8036793843262,16.613466658581576,4,1.2230892246250369,6.9313003166786995,131.06793475244274,146.00838340950608,0,59375,3808.4886069669315,-1408.4886069669315,0,{"$f":"IF(AND(R91=1,S91>=SC_LT,V91<>0,OR(IF(AND($G$4=$J$4,B91=\"X\"),TRUE,FALSE),IF(AND($G$4=$J$3,A91=\"X\",D91<>$O$4),TRUE,FALSE))),MAX($W$25:W90)+1,0)","v":0}]
[null,"X",3295507512,50.8,5.5,751,135.54545454545453,127.54545454545453,328707.39746922464,26624.138709932282,2577.1784548549331,17.884966633895399,4,1.3230487140701055,7.0312598061237681,122.47679872686157,136.28846081396861,1,75000,4022.687715734723,-1622.687715734723,0,{"$f":"IF(AND(R92=1,S92>=SC_LT,V92<>0,OR(IF(AND($G$4=$J$4,B92=\"X\"),TRUE,FALSE),IF(AND($G$4=$J$3,A92=\"X\",D92<>$O$4),TRUE,FALSE))),MAX($W$25:W91)+1,0)","v":0}]
[null,"X",3295508042,50.8,5.5,804,145.18181818181819,137.18181818181819,328707.39746922464,26624.138709932282,2396.1440504714851,19.156466609209229,4,1.4230082035151739,7.1312192955688367,115.09263476054031,127.93409394424552,1,90625,4236.8868245025142,-1836.8868245025142,0,{"$f":"IF(AND(R93=1,S93>=SC_LT,V93<>0,OR(IF(AND($G$4=$J$4,B93=\"X\"),TRUE,FALSE),IF(AND($G$4=$J$3,A93=\"X\",D93<>$O$4),TRUE,FALSE))),MAX($W$25:W92)+1,0)","v":0}]
[null,"X",3295508572,50.8,5.5,857,154.81818181818181,146.81818181818181,328707.39746922464,26624.138709932282,2238.8739146510657,20.427966584523048,4,1.5229676929602425,7.2311787850139053,108.67778519722842,120.67639938187931,0,100000,4451.0859332703058,-2051.0859332703058,0,{"$f":"IF(AND(R94=1,S94>=SC_LT,V94<>0,OR(IF(AND($G$4=$J$4,B94=\"X\"),TRUE,FALSE),IF(AND($G$4=$J$3,A94=\"X\",D94<>$O$4),TRUE,FALSE))),MAX($W$25:W93)+1,0)","v":0}]
[null,"X",3296006482,50.8,6,648,107,99,461449.07586090924,33717.143154652455,4661.1017763728205,16.951339278297944,4,0.73152932594370179,6.4397404179973643,207.47739047480118,232.4572526832564,0,21250,3610.5537700319369,-1210.5537700319369,0,{"$f":"IF(AND(R95=1,S95>=SC_LT,V95<>0,OR(IF(AND($G$4=$J$4,B95=\"X\"),TRUE,FALSE),IF(AND($G$4=$J$3,A95=\"X\",D95<>$O$4),TRUE,FALSE))),MAX($W$25:W94)+1,0)","v":0}]
[null,"X",3296007112,50.8,6,711,117.5,109.5,461449.07586090924,33717.143154652455,4214.1468115151529,18.614788459813166,4,0.80911576960439746,6.5173268616580602,189.24666379436408,211.8311967499537,0,33333,3864.4158446797933,-1464.4158446797933,0,{"$f":"IF(AND(R96=1,S96>=SC_LT,V96<>0,OR(IF(AND($G$4=$J$4,B96=\"X\"),TRUE,FALSE),IF(AND($G$4=$J$3,A96=\"X\",D96<>$O$4),TRUE,FALSE))),MAX($W$25:W95)+1,0)","v":0}]
[null,"X",3296007752,50.8,6,775,128.16666666666666,120.16666666666666,461449.07586090924,33717.143154652455,3840.0755272752508,20.304641596590532,4,0.88793374411685,6.5961448361705131,173.98877009550014,194.56857335738971,0,53125,4122.307476068092,-1722.307476068092,0,{"$f":"IF(AND(R97=1,S97>=SC_LT,V97<>0,OR(IF(AND($G$4=$J$4,B97=\"X\"),TRUE,FALSE),IF(AND($G$4=$J$3,A97=\"X\",D97<>$O$4),TRUE,FALSE))),MAX($W$25:W96)+1,0)","v":0}]
[null,"X",3296008382,50.8,6,838,138.66666666666666,130.66666666666666,461449.07586090924,33717.143154652455,3531.4980295477749,21.968090778105747,4,0.96552018777754578,6.673731279831209,161.40228496137865,180.32835403258068,0,68750,4376.1695507159493,-1976.1695507159493,0,{"$f":"IF(AND(R98=1,S98>=SC_LT,V98<>0,OR(IF(AND($G$4=$J$4,B98=\"X\"),TRUE,FALSE),IF(AND($G$4=$J$3,A98=\"X\",D98<>$O$4),TRUE,FALSE))),MAX($W$25:W97)+1,0)","v":0}]
[null,"X",3296009022,50.8,6,902,149.33333333333334,141.33333333333334,461449.07586090924,33717.143154652455,3264.9698763743577,23.657943914883116,4,1.0443381622899985,6.7525492543436609,150.53093931094247,168.02862581073305,0,84375,4634.0611821042476,-2234.0611821042476,0,{"$f":"IF(AND(R99=1,S99>=SC_LT,V99<>0,OR(IF(AND($G$4=$J$4,B99=\"X\"),TRUE,FALSE),IF(AND($G$4=$J$3,A99=\"X\",D99<>$O$4),TRUE,FALSE))),MAX($W$25:W98)+1,0)","v":0}]
[null,"X",3296009662,50.8,6,966,160,152,461449.07586090924,33717.143154652455,3035.8491832954555,25.347797051660478,4,1.1231561368024512,6.8313672288561138,141.18539655881318,157.45517523405704,0,93750,4891.9528134925467,-2491.9528134925467,0,{"$f":"IF(AND(R100=1,S100>=SC_LT,V100<>0,OR(IF(AND($G$4=$J$4,B100=\"X\"),TRUE,FALSE),IF(AND($G$4=$J$3,A100=\"X\",D100<>$O$4),TRUE,FALSE))),MAX($W$25:W99)+1,0)","v":0}]
[null,"X",3296010302,50.8,6,1030,170.66666666666666,162.66666666666666,461449.07586090924,33717.143154652455,2836.777105702311,27.037650188437844,4,1.2019741113149038,6.9101852033685667,133.06549875778279,148.26840670022378,0,128571,5149.8444448808459,-2749.8444448808459,0,{"$f":"IF(AND(R101=1,S101>=SC_LT,V101<>0,OR(IF(AND($G$4=$J$4,B101=\"X\"),TRUE,FALSE),IF(AND($G$4=$J$3,A101=\"X\",D101<>$O$4),TRUE,FALSE))),MAX($W$25:W100)+1,0)","v":0}]
[null,"X",3296010942,50.8,6,1094,181.33333333333334,173.33333333333334,461449.07586090924,33717.143154652455,2662.2062068898608,28.727503325215213,4,1.2807920858273567,6.9890031778810195,125.94497299380228,140.21231737055459,0,171429,5407.7360762691442,-3007.7360762691442,0,{"$f":"IF(AND(R102=1,S102>=SC_LT,V102<>0,OR(IF(AND($G$4=$J$4,B102=\"X\"),TRUE,FALSE),IF(AND($G$4=$J$3,A102=\"X\",D102<>$O$4),TRUE,FALSE))),MAX($W$25:W101)+1,0)","v":0}]
[null,"X",3396008112,66.674999999999997,6,811,134.16666666666666,127.16666666666666,360650.94611489022,33717.143154652455,2836.0493796714827,27.195783383531168,4,1.202282536074873,6.9104936281285356,133.03581573508609,148.23482363482304,0,128571,4273.8518470750851,-1873.8518470750851,0,{"$f":"IF(AND(R103=1,S103>=SC_LT,V103<>0,OR(IF(AND($G$4=$J$4,B103=\"X\"),TRUE,FALSE),IF(AND($G$4=$J$3,A103=\"X\",D103<>$O$4),TRUE,FALSE))),MAX($W$25:W102)+1,0)","v":0}]
[null,"X",3396008612,66.674999999999997,6,861,142.5,135.5,360650.94611489022,33717.143154652455,2661.6305986338762,28.884962475675966,4,1.2810690718595958,6.9892801639132589,125.92149466239321,140.18575422881301,0,171429,4475.7427239339177,-2075.7427239339177,0,{"$f":"IF(AND(R104=1,S104>=SC_LT,V104<>0,OR(IF(AND($G$4=$J$4,B104=\"X\"),TRUE,FALSE),IF(AND($G$4=$J$3,A104=\"X\",D104<>$O$4),TRUE,FALSE))),MAX($W$25:W103)+1,0)","v":0}]
[null,"X",3396009112,66.674999999999997,6,911,150.83333333333334,143.83333333333334,360650.94611489022,33717.143154652455,2507.4225685855636,30.57414156782076,4,1.3598556076443189,7.0680666996979813,119.63154451353492,133.06936957436844,1,200000,4677.6336007927512,-2277.6336007927512,0,{"$f":"IF(AND(R105=1,S105>=SC_LT,V105<>0,OR(IF(AND($G$4=$J$4,B105=\"X\"),TRUE,FALSE),IF(AND($G$4=$J$3,A105=\"X\",D105<>$O$4),TRUE,FALSE))),MAX($W$25:W104)+1,0)","v":0}]
[null,"X",3396009612,66.674999999999997,6,961,159.16666666666666,152.16666666666666,360650.94611489022,33717.143154652455,2370.1047937451713,32.263320659965551,4,1.438642143429042,7.1468532354827046,114.03052647298537,126.73243559401418,1,250000,4879.5244776515847,-2479.5244776515847,0,{"$f":"IF(AND(R106=1,S106>=SC_LT,V106<>0,OR(IF(AND($G$4=$J$4,B106=\"X\"),TRUE,FALSE),IF(AND($G$4=$J$3,A106=\"X\",D106<>$O$4),TRUE,FALSE))),MAX($W$25:W105)+1,0)","v":0}]
[null,"X",3296507632,50.8,6.5,763,116.38461538461539,108.38461538461539,630036.80336873792,42059.544271489729,5812.9726357655027,21.829626902678442,4,0.58657297294776911,6.2947840650014317,254.46074329522571,285.61373295938625,0,23750,4079.6643856900373,-1679.6643856900373,0,{"$f":"IF(AND(R107=1,S107>=SC_LT,V107<>0,OR(IF(AND($G$4=$J$4,B107=\"X\"),TRUE,FALSE),IF(AND($G$4=$J$3,A107=\"X\",D107<>$O$4),TRUE,FALSE))),MAX($W$25:W106)+1,0)","v":0}]
[null,"X",3296508382,50.8,6.5,838,127.92307692307693,119.92307692307693,630036.80336873792,42059.544271489729,5253.674434761765,23.993833138899046,4,0.64901864075626137,6.3572297328099241,231.64767836237192,259.80326684011555,0,38250,4381.2879730530585,-1981.2879730530585,0,{"$f":"IF(AND(R108=1,S108>=SC_LT,V108<>0,OR(IF(AND($G$4=$J$4,B108=\"X\"),TRUE,FALSE),IF(AND($G$4=$J$3,A108=\"X\",D108<>$O$4),TRUE,FALSE))),MAX($W$25:W107)+1,0)","v":0}]
[null,"X",3296509132,50.8,6.5,913,139.46153846153845,131.46153846153845,630036.80336873792,42059.544271489729,4792.5561403122256,26.158039375119643,4,0.71146430856475329,6.4196754006184165,212.83924741422052,238.52360226313937,0,59375,4682.9115604160788,-2282.9115604160788,0,{"$f":"IF(AND(R109=1,S109>=SC_LT,V109<>0,OR(IF(AND($G$4=$J$4,B109=\"X\"),TRUE,FALSE),IF(AND($G$4=$J$3,A109=\"X\",D109<>$O$4),TRUE,FALSE))),MAX($W$25:W108)+1,0)","v":0}]
[null,"X",3296509892,50.8,6.5,989,151.15384615384616,143.15384615384616,630036.80336873792,42059.544271489729,4401.1168424468524,28.351101694489849,4,0.77474258527735873,6.4829536773310217,196.87293444656314,220.45948062431822,0,75000,4988.556795610607,-2588.556795610607,0,{"$f":"IF(AND(R110=1,S110>=SC_LT,V110<>0,OR(IF(AND($G$4=$J$4,B110=\"X\"),TRUE,FALSE),IF(AND($G$4=$J$3,A110=\"X\",D110<>$O$4),TRUE,FALSE))),MAX($W$25:W109)+1,0)","v":0}]
[null,"X",3296510642,{"$f":"INDEX($O$3:$O$4,MATCH(VALUE(LEFT(C111,3)),$Q$3:$Q$4,0))","v":50.8},{"$f":"VALUE(RIGHT(LEFT(C111,5),2))/10","v":6.5},{"$f":"VALUE(RIGHT(LEFT(C111,9),4))","v":1064},{"$f":"(F111/E111)-1","v":162.69230769230768},{"$f":"G111-VLOOKUP(D111,$O$3:$P$4,2,0)","v":154.69230769230768},{"$f":"(($E111^4)*206000*PI())/(32*($D111+$E111))","v":630036.80336873792},{"$f":"((E111^3)*VLOOKUP(E111,$O$7:$P$13,2,0)*PI())/32","v":42059.544271489729},{"$f":"I111/H111","v":4072.8386095443034},{"$f":"((PI()*((E111/2)^2))*(PI()*(D111+E111)))*G111*(7.85/1000000)*M111","v":30.515307930710442},4,{"$f":"((SC_LMT/M111)+SC_SBD)/K111","v":0.83718825308585065},{"$f":"N111+SC_RDT","v":6.5453993451395132},{"$f":"((((O111+SC_TOL_MIN)*K111)-SC_SBD)*M111)/(SC_HMA*9.81)","v":183.48288128742863},{"$f":"((((O111+SC_TOL_PLUS)*K111)-SC_SBD)*M111)/(SC_HMA*9.81)","v":205.31011273287979},{"$f":"IF(AND(SC_W>=P111,SC_W<=Q111),1,0)","v":0},{"$f":"_xlfn.IFNA(VLOOKUP(ROUND(VLOOKUP(ROUND(1-(SC_RDT/O111),2),SC_LT_TABLE,2,0)-(($I111*O111)/($H111*J111)),2),SC_LT_TABLE,3,0),0)","v":90625},{"$f":"((F111+(O111*E111)+$K$9+$K$8+$K$11)*M111)+IF(M111=4,$K$10,0)","v":5290.1803829736273},{"$f":"SC_DW-T111","v":-2890.1803829736273},0,{"$f":"IF(AND(R111=1,S111>=SC_LT,V111<>0,OR(IF(AND($G$4=$J$4,B111=\"X\"),TRUE,FALSE),IF(AND($G$4=$J$3,A111=\"X\",D111<>$O$4),TRUE,FALSE))),MAX($W$25:W110)+1,0)","v":0}]
[null,"X",3296511402,50.8,6.5,1140,174.38461538461539,166.38461538461539,630036.80336873792,42059.544271489729,3786.6289615319429,32.708370250080655,4,0.90046652979845621,6.6086776218521193,171.80875240091083,192.10212384649668,0,114286,5595.8256181681554,-3195.8256181681554,{"$f":"IF(U112>=$K$15,$J$15,IF(U112>=$K$14,$J$14,IF(AND(U112>=$K$13,M112=4),$J$14,IF(U112>=$K$13,$J$13,0))))","v":0},{"$f":"IF(AND(R112=1,S112>=SC_LT,V112<>0,OR(IF(AND($G$4=$J$4,B112=\"X\"),TRUE,FALSE),IF(AND($G$4=$J$3,A112=\"X\",D112<>$O$4),TRUE,FALSE))),MAX($W$25:W111)+1,0)","v":0}]
[null,"X",3296512162,50.8,6.5,1216,186.07692307692307,178.07692307692307,630036.80336873792,42059.544271489729,3538.0036474270382,34.901432569450861,4,0.96374480651106142,6.6719558985647245,161.66764087141308,180.62857496938383,0,157143,5901.4708533626826,-3501.4708533626826,0,{"$f":"IF(AND(R113=1,S113>=SC_LT,V113<>0,OR(IF(AND($G$4=$J$4,B113=\"X\"),TRUE,FALSE),IF(AND($G$4=$J$3,A113=\"X\",D113<>$O$4),TRUE,FALSE))),MAX($W$25:W112)+1,0)","v":0}]
[null,"X",3396510182,66.674999999999997,6.5,1018,155.61538461538461,148.61538461538461,493353.04179062089,42059.544271489729,3319.6633246780907,37.274461416125632,4,1.0271320634467183,6.7353431555003809,152.76181576524812,170.55261639725049,0,200000,5111.1189220430097,-2711.1189220430097,0,{"$f":"IF(AND(R114=1,S114>=SC_LT,V114<>0,OR(IF(AND($G$4=$J$4,B114=\"X\"),TRUE,FALSE),IF(AND($G$4=$J$3,A114=\"X\",D114<>$O$4),TRUE,FALSE))),MAX($W$25:W113)+1,0)","v":0}]
[null,"X",3396510772,66.674999999999997,6.5,1077,164.69230769230768,157.69230769230768,493353.04179062089,42059.544271489729,3128.5802650136939,39.44865145423875,4,1.0898658023114762,6.7980768943651393,144.9677798826562,161.73452467340186,0,225000,5348.749999253494,-2948.749999253494,0,{"$f":"IF(AND(R115=1,S115>=SC_LT,V115<>0,OR(IF(AND($G$4=$J$4,B115=\"X\"),TRUE,FALSE),IF(AND($G$4=$J$3,A115=\"X\",D115<>$O$4),TRUE,FALSE))),MAX($W$25:W114)+1,0)","v":0}]
[null,"X",3396511372,66.674999999999997,6.5,1137,173.92307692307693,166.92307692307693,493353.04179062089,42059.544271489729,2955.5712181004938,41.659692170963957,4,1.1536628248858067,6.8618739169394694,137.91096007862538,153.75051160905332,0,262500,5590.4087218404266,-3190.4087218404266,0,{"$f":"IF(AND(R116=1,S116>=SC_LT,V116<>0,OR(IF(AND($G$4=$J$4,B116=\"X\"),TRUE,FALSE),IF(AND($G$4=$J$3,A116=\"X\",D116<>$O$4),TRUE,FALSE))),MAX($W$25:W115)+1,0)","v":0}]
[null,"X",3397008372,66.674999999999997,7,837,118.57142857142857,111.57142857142857,659081.5134125523,51857.877233725019,5907.2606835952192,33.163906270197906,4,0.57721045730959719,6.2854215493632601,258.30663329392598,289.96493319495579,0,62500,4387.9918033821714,-1987.9918033821714,0,{"$f":"IF(AND(R117=1,S117>=SC_LT,V117<>0,OR(IF(AND($G$4=$J$4,B117=\"X\"),TRUE,FALSE),IF(AND($G$4=$J$3,A117=\"X\",D117<>$O$4),TRUE,FALSE))),MAX($W$25:W116)+1,0)","v":0}]
[null,"X",3397009062,66.674999999999997,7,906,128.42857142857142,121.42857142857142,659081.5134125523,51857.877233725019,5427.7301104563139,35.920905707117967,4,0.62820600347395339,6.336417095527616,238.74718882821188,267.83557967845218,0,81250,4665.4196786747734,-2265.4196786747734,0,{"$f":"IF(AND(R118=1,S118>=SC_LT,V118<>0,OR(IF(AND($G$4=$J$4,B118=\"X\"),TRUE,FALSE),IF(AND($G$4=$J$3,A118=\"X\",D118<>$O$4),TRUE,FALSE))),MAX($W$25:W117)+1,0)","v":0}]
[null,"X",3397009752,66.674999999999997,7,975,138.28571428571428,131.28571428571428,659081.5134125523,51857.877233725019,5020.2073926962639,38.677905144038036,4,0.67920154963830959,6.3874126416919728,222.12485354233291,249.02924116225054,0,93750,4942.8475539673755,-2542.8475539673755,0,{"$f":"IF(AND(R119=1,S119>=SC_LT,V119<>0,OR(IF(AND($G$4=$J$4,B119=\"X\"),TRUE,FALSE),IF(AND($G$4=$J$3,A119=\"X\",D119<>$O$4),TRUE,FALSE))),MAX($W$25:W118)+1,0)","v":0}]
[null,"X",3397010442,66.674999999999997,7,1044,148.14285714285714,141.14285714285714,659081.5134125523,51857.877233725019,4669.6058642589742,41.434904580958097,4,0.73019709580266579,6.4384081878563286,207.82426144415771,232.84969891653046,0,128571,5220.2754292599775,-2820.2754292599775,0,{"$f":"IF(AND(R120=1,S120>=SC_LT,V120<>0,OR(IF(AND($G$4=$J$4,B120=\"X\"),TRUE,FALSE),IF(AND($G$4=$J$3,A120=\"X\",D120<>$O$4),TRUE,FALSE))),MAX($W$25:W119)+1,0)","v":0}]
[null,"X",3397011132,66.674999999999997,7,1113,158,151,659081.5134125523,51857.877233725019,4364.778234520214,44.191904017878173,4,0.78119264196702209,6.4894037340206854,195.39072867384266,218.78252831689306,0,171429,5497.7033045525795,-3097.7033045525795,0,{"$f":"IF(AND(R121=1,S121>=SC_LT,V121<>0,OR(IF(AND($G$4=$J$4,B121=\"X\"),TRUE,FALSE),IF(AND($G$4=$J$3,A121=\"X\",D121<>$O$4),TRUE,FALSE))),MAX($W$25:W120)+1,0)","v":0}]
[null,"X",3397011832,66.674999999999997,7,1183,168,161,659081.5134125523,51857.877233725019,4093.6739963512564,46.988859968376786,4,0.83292725401781831,6.5411383460714809,184.33273031479027,206.27162314771331,0,212500,5779.1518736900016,-3379.1518736900016,0,{"$f":"IF(AND(R122=1,S122>=SC_LT,V122<>0,OR(IF(AND($G$4=$J$4,B122=\"X\"),TRUE,FALSE),IF(AND($G$4=$J$3,A122=\"X\",D122<>$O$4),TRUE,FALSE))),MAX($W$25:W121)+1,0)","v":0}]
[null,"X",3397012522,66.674999999999997,7,1252,177.85714285714286,170.85714285714286,659081.5134125523,51857.877233725019,3857.5004965617609,49.745859405296855,4,0.88392280018217451,6.5921338922358377,174.69951251353893,195.3726999907164,0,250000,6056.5797489826036,-3656.5797489826036,0,{"$f":"IF(AND(R123=1,S123>=SC_LT,V123<>0,OR(IF(AND($G$4=$J$4,B123=\"X\"),TRUE,FALSE),IF(AND($G$4=$J$3,A123=\"X\",D123<>$O$4),TRUE,FALSE))),MAX($W$25:W122)+1,0)","v":0}]
[null,null,{"$f":"ROUND(D124,0)&\"x\"&E124&\"-\"&ROUND(F124,0)","v":"51x5-260"},50.8,5,{"$f":"(G124+1)*E124","v":259.58886457081508},{"$f":"H124+VLOOKUP(D124,$O$3:$P$4,2,0)","v":50.91777291416301},{"$f":"I124/K124","v":42.91777291416301},{"$f":"(($E124^4)*206000*PI())/(32*($D124+$E124))","v":226523.32781680438},{"$f":"((E124^3)*VLOOKUP(E124,$O$7:$P$13,2,0)*PI())/32","v":20371.264863121316},{"$f":"(SC_HMT-SC_LMT)/(M124*SC_RDT)","v":5278.0774125875232},{"$f":"((PI()*((E124/2)^2))*(PI()*(D124+E124)))*G124*(7.85/1000000)*M124","v":2.7515855110222898},2,{"$f":"((SC_LMT/M124)+SC_SBD)/K124","v":1.1062295652059422},{"$f":"N124+SC_RDT","v":6.8144406572596052},{"$f":"((((O124+SC_TOL_MIN)*K124)-SC_SBD)*M124)/(SC_HMA*9.81)","v":124.99999999999999},{"$f":"((((O124+SC_TOL_PLUS)*K124)-SC_SBD)*M124)/(SC_HMA*9.81)","v":139.14318468224863},{"$f":"IF(AND(SC_W>=P124,SC_W<=Q124),1,0)","v":1},{"$f":"_xlfn.IFNA(VLOOKUP(ROUND(VLOOKUP(ROUND(1-(SC_RDT/O124),2),SC_LT_TABLE,2,0)-(($I124*O124)/($H124*J124)),2),SC_LT_TABLE,3,0),0)","v":0},{"$f":"((F124+(O124*E124)+$K$9+$K$8+$K$11)*M124)+IF(M124=4,$K$10,0)","v":961.32213571422619},{"$f":"SC_DW-T124","v":1438.6778642857739},{"$f":"IF(U124>=$K$15,$J$15,IF(U124>=$K$14,$J$14,IF(AND(U124>=$K$13,M124=4),$J$14,IF(U124>=$K$13,$J$13,0))))","v":"Ex_Center"},{"$f":"IF(AND(R124=1,S124>=SC_LT,V124<>0,OR(IF(AND($G$4=$J$4,B124=\"X\"),TRUE,FALSE),IF(AND($G$4=$J$3,A124=\"X\",D124<>$O$4),TRUE,FALSE))),MAX($W$25:W123)+1,0)","v":0}]
[null,null,"51x5,5-392",50.8,5.5,392.02826261493493,70.277865929988167,62.277865929988174,328707.39746922464,26624.138709932282,5278.0774125875232,4.6365158148394841,2,1.1062295652059422,6.8144406572596052,124.99999999999999,139.14318468224863,1,0,1233.0153724597255,1166.9846275402745,"Ex_Center",{"$f":"IF(AND(R125=1,S125>=SC_LT,V125<>0,OR(IF(AND($G$4=$J$4,B125=\"X\"),TRUE,FALSE),IF(AND($G$4=$J$3,A125=\"X\",D125<>$O$4),TRUE,FALSE))),MAX($W$25:W124)+1,0)","v":0}]
[null,null,"51x6-579",50.8,6,578.56495779362422,95.427492965604031,87.427492965604031,461449.07586090924,33717.143154652455,5278.0774125875232,7.5589897651277784,2,1.1062295652059422,6.8144406572596052,124.99999999999999,139.14318468224863,1,0,1612.9032034743636,787.09679652563636,"Ex_Center",{"$f":"IF(AND(R126=1,S126>=SC_LT,V126<>0,OR(IF(AND($G$4=$J$4,B126=\"X\"),TRUE,FALSE),IF(AND($G$4=$J$3,A126=\"X\",D126<>$O$4),TRUE,FALSE))),MAX($W$25:W125)+1,0)","v":0}]
[null,null,"67x6-458",66.674999999999997,6,457.97990509360659,75.329984182267765,68.329984182267765,360650.94611489022,33717.143154652455,5278.0774125875232,7.6347500575370821,2,1.1062295652059422,6.8144406572596052,124.99999999999999,139.14318468224863,1,0,1371.7330980743284,1028.2669019256716,"Ex_Center",{"$f":"IF(AND(R127=1,S127>=SC_LT,V127<>0,OR(IF(AND($G$4=$J$4,B127=\"X\"),TRUE,FALSE),IF(AND($G$4=$J$3,A127=\"X\",D127<>$O$4),TRUE,FALSE))),MAX($W$25:W126)+1,0)","v":0}]
[null,null,"51x6,5-834",50.8,6.5,834.3960132206829,127.3686174185666,119.3686174185666,630036.80336873792,42059.544271489729,5278.0774125875232,11.944918098362491,2,1.1062295652059422,6.8144406572596052,124.99999999999999,139.14318468224863,1,25000,2131.3797549857409,268.62024501425913,"Center",{"$f":"IF(AND(R128=1,S128>=SC_LT,V128<>0,OR(IF(AND($G$4=$J$4,B128=\"X\"),TRUE,FALSE),IF(AND($G$4=$J$3,A128=\"X\",D128<>$O$4),TRUE,FALSE))),MAX($W$25:W127)+1,0)","v":0}]
[null,null,"67x6,5-660",66.674999999999997,6.5,659.56872644407417,100.4721117606268,93.472111760626802,493353.04179062089,42059.544271489729,5278.0774125875232,12.033012874897654,2,1.1062295652059422,6.8144406572596052,124.99999999999999,139.14318468224863,1,25000,1781.7251814325232,618.27481856747681,"Ex_Center",{"$f":"IF(AND(R129=1,S129>=SC_LT,V129<>0,OR(IF(AND($G$4=$J$4,B129=\"X\"),TRUE,FALSE),IF(AND($G$4=$J$3,A129=\"X\",D129<>$O$4),TRUE,FALSE))),MAX($W$25:W128)+1,0)","v":0}]
[null,null,"67x7-930",66.674999999999997,7,930.10059255385386,131.87151322197911,124.87151322197913,659081.5134125523,51857.877233725019,5278.0774125875232,18.441940680373587,2,1.1062295652059422,6.8144406572596052,124.99999999999999,139.14318468224863,1,71875,2329.6033543093422,70.396645690657806,"No cut",{"$f":"IF(AND(R130=1,S130>=SC_LT,V130<>0,OR(IF(AND($G$4=$J$4,B130=\"X\"),TRUE,FALSE),IF(AND($G$4=$J$3,A130=\"X\",D130<>$O$4),TRUE,FALSE))),MAX($W$25:W129)+1,0)","v":0}]
[null,null,"67x7,5-1286",66.674999999999997,7.5,1285.8578742254422,170.44771656339228,163.44771656339228,862689.70093224838,62540.39672209759,5278.0774125875232,27.549306812340774,2,1.1062295652059422,6.8144406572596052,124.99999999999999,139.14318468224863,1,128571,3047.9323583097785,-647.93235830977846,0,{"$f":"IF(AND(R131=1,S131>=SC_LT,V131<>0,OR(IF(AND($G$4=$J$4,B131=\"X\"),TRUE,FALSE),IF(AND($G$4=$J$3,A131=\"X\",D131<>$O$4),TRUE,FALSE))),MAX($W$25:W130)+1,0)","v":0}]
[null,null,"51x5-474",50.8,5,474.1777291416301,93.835545828326019,85.835545828326019,226523.32781680438,20371.264863121316,2639.0387062937616,10.141705480927325,4,1.2920358585469909,7.0002469506006539,124.99999999999999,139.14318468224863,1,19167,2900.7158555785336,-500.71585557853359,0,{"$f":"IF(AND(R132=1,S132>=SC_LT,V132<>0,OR(IF(AND($G$4=$J$4,B132=\"X\"),TRUE,FALSE),IF(AND($G$4=$J$3,A132=\"X\",D132<>$O$4),TRUE,FALSE))),MAX($W$25:W131)+1,0)","v":0}]
[null,null,"51x5,5-735",50.8,5.5,734.55652522986986,132.55573185997633,124.55573185997635,328707.39746922464,26624.138709932282,2639.0387062937616,17.490478374191742,4,1.2920358585469909,7.0002469506006539,124.99999999999999,139.14318468224863,1,71875,3956.2315338326939,-1556.2315338326939,0,{"$f":"IF(AND(R133=1,S133>=SC_LT,V133<>0,OR(IF(AND($G$4=$J$4,B133=\"X\"),TRUE,FALSE),IF(AND($G$4=$J$3,A133=\"X\",D133<>$O$4),TRUE,FALSE))),MAX($W$25:W132)+1,0)","v":0}]
[null,null,"51x6-1103",50.8,6,1103.1299155872484,182.85498593120806,174.85498593120806,461449.07586090924,33717.143154652455,2639.0387062937616,28.968569207928091,4,1.2920358585469909,7.0002469506006539,124.99999999999999,139.14318468224863,1,171429,5444.5255891634097,-3044.5255891634097,0,{"$f":"IF(AND(R134=1,S134>=SC_LT,V134<>0,OR(IF(AND($G$4=$J$4,B134=\"X\"),TRUE,FALSE),IF(AND($G$4=$J$3,A134=\"X\",D134<>$O$4),TRUE,FALSE))),MAX($W$25:W133)+1,0)","v":0}]
[null,null,"67x6-868",66.674999999999997,6,867.95981018721318,143.65996836453553,136.65996836453553,360650.94611489022,33717.143154652455,2639.0387062937616,29.1200897927467,4,1.2920358585469909,7.0002469506006539,124.99999999999999,139.14318468224863,1,171429,4503.8451675632678,-2103.8451675632678,0,{"$f":"IF(AND(R135=1,S135>=SC_LT,V135<>0,OR(IF(AND($G$4=$J$4,B135=\"X\"),TRUE,FALSE),IF(AND($G$4=$J$3,A135=\"X\",D135<>$O$4),TRUE,FALSE))),MAX($W$25:W134)+1,0)","v":0}]
[null,null,"51x6,5-1610",50.8,6.5,1610.2920264413658,246.7372348371332,238.7372348371332,630036.80336873792,42059.544271489729,2639.0387062937616,46.279156069670343,4,1.2920358585469909,7.0002469506006539,124.99999999999999,139.14318468224863,1,310000,7487.1745264810806,-5087.1745264810806,0,{"$f":"IF(AND(R136=1,S136>=SC_LT,V136<>0,OR(IF(AND($G$4=$J$4,B136=\"X\"),TRUE,FALSE),IF(AND($G$4=$J$3,A136=\"X\",D136<>$O$4),TRUE,FALSE))),MAX($W$25:W135)+1,0)","v":0}]
[null,null,"67x6,5-1267",66.674999999999997,6.5,1267.1374528881483,193.9442235212536,186.9442235212536,493353.04179062089,42059.544271489729,2639.0387062937616,46.455345622740673,4,1.2920358585469909,7.0002469506006539,124.99999999999999,139.14318468224863,1,310000,6114.5562322682108,-3714.5562322682108,0,{"$f":"IF(AND(R137=1,S137>=SC_LT,V137<>0,OR(IF(AND($G$4=$J$4,B137=\"X\"),TRUE,FALSE),IF(AND($G$4=$J$3,A137=\"X\",D137<>$O$4),TRUE,FALSE))),MAX($W$25:W136)+1,0)","v":0}]
[null,null,"67x7-1804",66.674999999999997,7,1804.2011851077077,256.74302644395823,249.74302644395826,659081.5134125523,51857.877233725019,2639.0387062937616,71.809893556145298,4,1.2920358585469909,7.0002469506006539,124.99999999999999,139.14318468224863,1,390000,8276.8116550476479,-5876.8116550476479,0,{"$f":"IF(AND(R138=1,S138>=SC_LT,V138<>0,OR(IF(AND($G$4=$J$4,B138=\"X\"),TRUE,FALSE),IF(AND($G$4=$J$3,A138=\"X\",D138<>$O$4),TRUE,FALSE))),MAX($W$25:W137)+1,0)","v":0}]
[null,null,"67x7,5-2512",66.674999999999997,7.5,2511.7157484508843,333.89543312678455,326.89543312678455,862689.70093224838,62540.39672209759,2639.0387062937616,107.9344201953928,4,1.2920358585469909,7.0002469506006539,124.99999999999999,139.14318468224863,1,450000,11120.870402321558,-8720.8704023215578,0,{"$f":"IF(AND(R139=1,S139>=SC_LT,V139<>0,OR(IF(AND($G$4=$J$4,B139=\"X\"),TRUE,FALSE),IF(AND($G$4=$J$3,A139=\"X\",D139<>$O$4),TRUE,FALSE))),MAX($W$25:W138)+1,0)","v":0}]
[null,null,"51x5-152",50.8,5,152.29443228540754,29.458886457081505,21.458886457081505,226523.32781680438,20371.264863121316,10556.154825175046,0.79597594815080175,1,1.013326418535418,6.7215375105890809,124.99999999999999,139.14318468224863,1,0,372.90211983835297,2027.097880161647,"Ex_Center",{"$f":"IF(AND(R140=1,S140>=SC_LT,V140<>0,OR(IF(AND($G$4=$J$4,B140=\"X\"),TRUE,FALSE),IF(AND($G$4=$J$3,A140=\"X\",D140<>$O$4),TRUE,FALSE))),MAX($W$25:W139)+1,0)","v":0}]
[null,null,"51x5,5-221",50.8,5.5,220.76413130746747,39.138932964994083,31.138932964994087,328707.39746922464,26624.138709932282,10556.154825175046,1.2910770643556453,1,1.013326418535418,6.7215375105890809,124.99999999999999,139.14318468224863,1,0,444.73258761570742,1955.2674123842926,"Ex_Center",{"$f":"IF(AND(R141=1,S141>=SC_LT,V141<>0,OR(IF(AND($G$4=$J$4,B141=\"X\"),TRUE,FALSE),IF(AND($G$4=$J$3,A141=\"X\",D141<>$O$4),TRUE,FALSE))),MAX($W$25:W140)+1,0)","v":0}]
[null,null,"51x6-316",50.8,6,316.28247889681211,51.713746482802016,43.713746482802016,461449.07586090924,33717.143154652455,10556.154825175046,2.0481711728548224,1,1.013326418535418,6.7215375105890809,124.99999999999999,139.14318468224863,1,0,543.61170396034663,1856.3882960396534,"Ex_Center",{"$f":"IF(AND(R142=1,S142>=SC_LT,V142<>0,OR(IF(AND($G$4=$J$4,B142=\"X\"),TRUE,FALSE),IF(AND($G$4=$J$3,A142=\"X\",D142<>$O$4),TRUE,FALSE))),MAX($W$25:W141)+1,0)","v":0}]
[null,null,"67x6-253",66.674999999999997,6,252.98995254680329,41.164992091133882,34.164992091133882,360650.94611489022,33717.143154652455,10556.154825175046,2.0860513190594738,1,1.013326418535418,6.7215375105890809,124.99999999999999,139.14318468224863,1,0,480.31917761033776,1919.6808223896624,"Ex_Center",{"$f":"IF(AND(R143=1,S143>=SC_LT,V143<>0,OR(IF(AND($G$4=$J$4,B143=\"X\"),TRUE,FALSE),IF(AND($G$4=$J$3,A143=\"X\",D143<>$O$4),TRUE,FALSE))),MAX($W$25:W142)+1,0)","v":0}]
[null,null,"51x6,5-446",50.8,6.5,446.44800661034145,67.6843087092833,59.6843087092833,630036.80336873792,42059.544271489729,10556.154825175046,3.1737940650630745,1,1.013326418535418,6.7215375105890809,124.99999999999999,139.14318468224863,1,0,677.13800042917046,1722.8619995708295,"Ex_Center",{"$f":"IF(AND(R144=1,S144>=SC_LT,V144<>0,OR(IF(AND($G$4=$J$4,B144=\"X\"),TRUE,FALSE),IF(AND($G$4=$J$3,A144=\"X\",D144<>$O$4),TRUE,FALSE))),MAX($W$25:W143)+1,0)","v":0}]
[null,null,"67x6,5-356",66.674999999999997,6.5,355.78436322203709,53.736055880313401,46.736055880313401,493353.04179062089,42059.544271489729,10556.154825175046,3.2178414533306561,1,1.013326418535418,6.7215375105890809,124.99999999999999,139.14318468224863,1,0,586.47435704086615,1813.5256429591338,"Ex_Center",{"$f":"IF(AND(R145=1,S145>=SC_LT,V145<>0,OR(IF(AND($G$4=$J$4,B145=\"X\"),TRUE,FALSE),IF(AND($G$4=$J$3,A145=\"X\",D145<>$O$4),TRUE,FALSE))),MAX($W$25:W144)+1,0)","v":0}]
[null,null,"67x7-493",66.674999999999997,7,493.05029627692693,69.435756610989557,62.435756610989564,659081.5134125523,51857.877233725019,10556.154825175046,4.8552188157620257,1,1.013326418535418,6.7215375105890809,124.99999999999999,139.14318468224863,1,0,727.10105885105054,1672.8989411489495,"Ex_Center",{"$f":"IF(AND(R146=1,S146>=SC_LT,V146<>0,OR(IF(AND($G$4=$J$4,B146=\"X\"),TRUE,FALSE),IF(AND($G$4=$J$3,A146=\"X\",D146<>$O$4),TRUE,FALSE))),MAX($W$25:W145)+1,0)","v":0}]
[null,null,"67x7,5-673",66.674999999999997,7.5,672.92893711272109,88.723858281696138,81.723858281696138,862689.70093224838,62540.39672209759,10556.154825175046,7.1701775848314782,1,1.013326418535418,6.7215375105890809,124.99999999999999,139.14318468224863,1,0,910.34046844213924,1489.6595315578606,"Ex_Center",{"$f":"IF(AND(R147=1,S147>=SC_LT,V147<>0,OR(IF(AND($G$4=$J$4,B147=\"X\"),TRUE,FALSE),IF(AND($G$4=$J$3,A147=\"X\",D147<>$O$4),TRUE,FALSE))),MAX($W$25:W146)+1,0)","v":0}]
[null,null,"51x5-367",50.8,5,366.88329685622256,72.376659371244514,64.376659371244514,226523.32781680438,20371.264863121316,3518.7182750583488,5.866828688614464,3,1.1991327118764665,6.9073438039301296,124.99999999999999,139.14318468224863,1,0,1765.2600476276198,634.73995237238023,"Ex_Center",{"$f":"IF(AND(R148=1,S148>=SC_LT,V148<>0,OR(IF(AND($G$4=$J$4,B148=\"X\"),TRUE,FALSE),IF(AND($G$4=$J$3,A148=\"X\",D148<>$O$4),TRUE,FALSE))),MAX($W$25:W147)+1,0)","v":0}]
[null,null,"51x5,5-563",50.8,5.5,563.29239392240243,101.41679889498226,93.416798894982264,328707.39746922464,26624.138709932282,3518.7182750583488,10.036316251451517,3,1.1991327118764665,6.9073438039301296,124.99999999999999,139.14318468224863,1,19167,2364.8483545320541,35.151645467945855,"No cut",{"$f":"IF(AND(R149=1,S149>=SC_LT,V149<>0,OR(IF(AND($G$4=$J$4,B149=\"X\"),TRUE,FALSE),IF(AND($G$4=$J$3,A149=\"X\",D149<>$O$4),TRUE,FALSE))),MAX($W$25:W148)+1,0)","v":0}]
[null,null,"51x6-841",50.8,6,840.84743669043633,139.14123944840605,131.14123944840605,461449.07586090924,33717.143154652455,3518.7182750583488,16.532455776818871,3,1.1991327118764665,6.9073438039301296,124.99999999999999,139.14318468224863,1,62500,3207.8744985420517,-807.8744985420517,0,{"$f":"IF(AND(R150=1,S150>=SC_LT,V150<>0,OR(IF(AND($G$4=$J$4,B150=\"X\"),TRUE,FALSE),IF(AND($G$4=$J$3,A150=\"X\",D150<>$O$4),TRUE,FALSE))),MAX($W$25:W149)+1,0)","v":0}]
[null,null,"67x6-663",66.674999999999997,6,662.96985764040983,109.49497627340165,102.49497627340165,360650.94611489022,33717.143154652455,3518.7182750583488,16.646096215432824,3,1.1991327118764665,6.9073438039301296,124.99999999999999,139.14318468224863,1,62500,2674.241761391972,-274.24176139197198,0,{"$f":"IF(AND(R151=1,S151>=SC_LT,V151<>0,OR(IF(AND($G$4=$J$4,B151=\"X\"),TRUE,FALSE),IF(AND($G$4=$J$3,A151=\"X\",D151<>$O$4),TRUE,FALSE))),MAX($W$25:W150)+1,0)","v":0}]
[null,null,"51x6,5-1222",50.8,6.5,1222.3440198310243,187.0529261278499,179.0529261278499,630036.80336873792,42059.544271489729,3518.7182750583488,26.313372099898245,3,1.1991327118764665,6.9073438039301296,124.99999999999999,139.14318468224863,1,128571,4362.7252636697103,-1962.7252636697103,0,{"$f":"IF(AND(R152=1,S152>=SC_LT,V152<>0,OR(IF(AND($G$4=$J$4,B152=\"X\"),TRUE,FALSE),IF(AND($G$4=$J$3,A152=\"X\",D152<>$O$4),TRUE,FALSE))),MAX($W$25:W151)+1,0)","v":0}]
[null,null,"67x6,5-963",66.674999999999997,6.5,963.35308966611126,147.20816764094019,140.20816764094019,493353.04179062089,42059.544271489729,3518.7182750583488,26.445514264700989,3,1.1991327118764665,6.9073438039301296,124.99999999999999,139.14318468224863,1,128571,3585.7524731749718,-1185.7524731749718,0,{"$f":"IF(AND(R153=1,S153>=SC_LT,V153<>0,OR(IF(AND($G$4=$J$4,B153=\"X\"),TRUE,FALSE),IF(AND($G$4=$J$3,A153=\"X\",D153<>$O$4),TRUE,FALSE))),MAX($W$25:W152)+1,0)","v":0}]
[null,null,"67x7-1367",66.674999999999997,7,1367.1508888307808,194.3072698329687,187.3072698329687,659081.5134125523,51857.877233725019,3518.7182750583488,40.760165593834692,3,1.1991327118764665,6.9073438039301296,124.99999999999999,139.14318468224863,1,275000,4807.5068863748747,-2407.5068863748747,0,{"$f":"IF(AND(R154=1,S154>=SC_LT,V154<>0,OR(IF(AND($G$4=$J$4,B154=\"X\"),TRUE,FALSE),IF(AND($G$4=$J$3,A154=\"X\",D154<>$O$4),TRUE,FALSE))),MAX($W$25:W153)+1,0)","v":0}]
[null,null,"67x7,5-1899",66.674999999999997,7.5,1898.7868113381633,252.17157484508843,245.17157484508843,862689.70093224838,62540.39672209759,3518.7182750583488,61.137387682527887,3,1.1991327118764665,6.9073438039301296,124.99999999999999,139.14318468224863,1,360000,6412.7756696029173,-4012.7756696029173,0,{"$f":"IF(AND(R155=1,S155>=SC_LT,V155<>0,OR(IF(AND($G$4=$J$4,B155=\"X\"),TRUE,FALSE),IF(AND($G$4=$J$3,A155=\"X\",D155<>$O$4),TRUE,FALSE))),MAX($W$25:W154)+1,0)","v":0}]
[]
[]
[]
[null,null,-0.03,null,10000]
[null,null,-0.02,null,10833]
[null,null,-0.01,null,11667]
[null,null,0,null,12500]
[null,null,0.01,1,13125]
[null,null,0.02,1,13750]
[null,null,0.03,1,14375]
[null,null,0.04,1,15000]
[null,null,0.05,1,15833]
[null,null,0.06,1,16667]
[null,null,7.0000000000000007E-2,1,17500]
[null,null,0.08,1,18333]
[null,null,0.09,1,19167]
[null,null,0.1,1,20000]
[null,null,0.11,1,21250]
[null,null,0.12,1,22500]
[null,null,0.13,1,23750]
[null,null,0.14000000000000001,1,25000]
[null,null,0.15,1,26667]
[null,null,0.16,1,28333]
[null,null,0.17,1,30000]
[null,null,0.18,1,31667]
[null,null,0.19,1,33333]
[null,null,0.2,1.01,35000]
[null,null,0.21,1.01,38250]
[null,null,0.22,1.02,41500]
[null,null,0.23,1.02,44750]
[null,null,0.24,1.03,50000]
[null,null,0.25,1.04,53125]
[null,null,0.26,1.05,56250]
[null,null,0.27,1.05,59375]
[null,null,0.28000000000000003,1.06,62500]
[null,null,0.28999999999999998,1.06,65625]
[null,null,0.3,1.07,68750]
[null,null,0.31,1.07,71875]
[null,null,0.32,1.08,75000]
[null,null,0.33,1.08,78125]
[null,null,0.34,1.0900000000000001,81250]
[null,null,0.35,1.0900000000000001,84375]
[null,null,0.36,1.0900000000000001,87500]
[null,null,0.37,1.0900000000000001,90625]
[null,null,0.38,1.0900000000000001,93750]
[null,null,0.39,1.0900000000000001,96875]
[null,null,0.4,1.1000000000000001,100000]
[null,null,0.41,1.1000000000000001,114286]
[null,null,0.42,1.1000000000000001,128571]
[null,null,0.43,1.1000000000000001,142857]
[null,null,0.44,1.1000000000000001,157143]
[null,null,0.45,1.1000000000000001,171429]
[null,null,0.46,1.1000000000000001,185714]
[null,null,0.47,1.1000000000000001,200000]
[null,null,0.48,1.1000000000000001,212500]
[null,null,0.49,1.1000000000000001,225000]
[null,null,0.5,1.1100000000000001,237500]
[null,null,0.51,1.1100000000000001,250000]
[null,null,0.52,1.1100000000000001,262500]
[null,null,0.53,1.1100000000000001,275000]
[null,null,0.54,1.1100000000000001,287500]
[null,null,0.55000000000000004,1.1100000000000001,300000]
[null,null,0.56000000000000005,1.1100000000000001,310000]
[null,null,0.56999999999999995,1.1100000000000001,320000]
[null,null,0.57999999999999996,1.1100000000000001,330000]
[null,null,0.59,1.1100000000000001,340000]
[null,null,0.6,1.1100000000000001,350000]
[null,null,0.61,1.1100000000000001,360000]
[null,null,0.62,1.1100000000000001,370000]
[null,null,0.63,1.1100000000000001,380000]
[null,null,0.64,1.1100000000000001,390000]
[null,null,0.65,1.1100000000000001,400000]
[null,null,0.66,1.1100000000000001,410000]
[null,null,0.67,1.1100000000000001,420000]
[null,null,0.68,1.1100000000000001,430000]
[null,null,0.69,1.1100000000000001,440000]
[null,null,0.7,1.1100000000000001,450000]
[null,null,0.71,1.1100000000000001,460000]
[null,null,0.72,1.1100000000000001,470000]
[null,null,0.73,1.1100000000000001,480000]
[null,null,0.74,1.1100000000000001,490000]
[null,null,0.75,1.1100000000000001,500000]
[null,null,0.76,1.1100000000000001,510000]
[null,null,0.77,1.1100000000000001,520000]
[null,null,0.78,1.1100000000000001,530000]
[null,null,0.79,1.1100000000000001,540000]
[null,null,0.8,1.1100000000000001,550000]
[null,null,0.81,1.1100000000000001,560000]
[null,null,0.82,1.1100000000000001,570000]
[null,null,0.83,1.1100000000000001,580000]
[null,null,0.84,1.1100000000000001,590000]
[null,null,0.85,1.1100000000000001,600000]
[null,null,0.86,1.1100000000000001,610000]
[null,null,0.87,1.1100000000000001,620000]
[null,null,0.88,1.1100000000000001,630000]
[null,null,0.89,1.1100000000000001,640000]
[null,null,0.9,1.1100000000000001,650000]
[null,null,0.91,1.1100000000000001,660000]
[null,null,0.92,1.1100000000000001,670000]
[null,null,0.93,1.1100000000000001,680000]
[null,null,0.94,1.1100000000000001,690000]
[null,null,0.95,1.1100000000000001,700000]
[null,null,0.96,1.1100000000000001,710000]
[null,null,0.97,1.1100000000000001,720000]
[null,null,0.98,1.1100000000000001,730000]
[null,null,0.99,1.1100000000000001,740000]
[null,null,1,1.1100000000000001,750000]

{"sheet":"Date","index":3,"n_rows":16,"n_cols":3,"rows_kept":16,"cut":false,"hidden":true,"merged":[]}
[]
["today",{"$f":"TODAY()","v":"2023-02-10"}]
[]
["release date","2023-02-09"]
["expiration date",{"$f":"B4+365","v":"2024-02-09"}]
[]
["days",{"$f":"B2-B4","v":1}]
[]
["warning","This file is more than one year old."]
[null,"Please check if you have the latest version.  "]
[null,"www.doco-international.com/en/support"]
[]
["Versie","V1.1"]
[]
["1.0","2021-03-01","start"]
["1.1","2020-02-09","Kabelset Home-X toegevoegd op verzoek van PM"]

{"sheet":"Matrix","index":4,"n_rows":133,"n_cols":72,"rows_kept":133,"cut":false,"hidden":true,"merged":[]}
[null,null,null,null,null,null,null,null,null,null,null,null,null,null,null,null,null,null,null,null,null,null,null,null,null,null,null,null,null,null,null,null,null,null,null,null,null,null,null,null,null,null,null,null,null,null,null,null,null,null,null,null,null,null,null,null,null,null,null,null,null,null,null,null,null,null,null,null,null,null,null,{"$f":"COLUMN()","v":72}]
[null,"DH-KG",1775,{"$f":"C2+25","v":1800},{"$f":"D2+25","v":1825},1850,1875,1900,1925,1950,1975,2000,2025,2050,2075,2100,2125,2150,2175,2200,2225,2250,2275,2300,2325,2350,2375,2400,2425,2450,2475,2500,2525,2550,2575,2600,2625,2650,2675,2700,2725,2750,2775,2800,2825,2850,2875,{"$f":"AU2+25","v":2900},2925,2950,2975,3000,3025,3050,3075,3100,3125,3150,3175,3200,3225,3250,3275,3300,3325,3350,3375,3400,{"$f":"BP2+25","v":3425},3450,3475,3500]
[null,40,"3295006632 (2)","3295006632 (2)","3295006632 (2)"]
[null,{"$f":"B3+2","v":42},"3295006192 (2)","3295006632 (2)","3295006632 (2)","3295006632 (2)","3295006632 (2)","3295006632 (2)","3295006632 (2)"]
[null,{"$f":"B4+2","v":44},"3295006192 (2)","3295006192 (2)","3295006192 (2)","3295006192 (2)","3295006632 (2)","3295006632 (2)","3295006632 (2)","3295006632 (2)","3295006632 (2)","3295006632 (2)","3295006632 (2)"]
[null,46,"3295005762 (2)","3295005762 (2)","3295006192 (2)","3295006192 (2)","3295006192 (2)","3295006192 (2)","3295006192 (2)","3295006192 (2)","3295006632 (2)","3295006632 (2)","3295006632 (2)","3295006632 (2)","3295006632 (2)","3295006632 (2)","3295006632 (2)"]
[null,48,"3295005762 (2)","3295005762 (2)","3295005762 (2)","3295005762 (2)","3295005762 (2)","3295006192 (2)","3295006192 (2)","3295006192 (2)","3295006192 (2)","3295006192 (2)","3295006192 (2)","3295006192 (2)","3295006632 (2)","3295006632 (2)","3295006632 (2)","3295006632 (2)","3295006632 (2)","3295006632 (2)","3295006632 (2)"]
[null,50,"3295005332 (2)","3295005762 (2)","3295005762 (2)","3295005762 (2)","3295005762 (2)","3295005762 (2)","3295005762 (2)","3295005762 (2)","3295005762 (2)","3295006192 (2)","3295006192 (2)","3295006192 (2)","3295006192 (2)","3295006192 (2)","3295006192 (2)","3295006192 (2)","3295006632 (2)","3295006632 (2)","3295006632 (2)","3295006632 (2)","3295006632 (2)","3295006632 (2)","3295006632 (2)"]
[null,52,"3295005332 (2)","3295005332 (2)","3295005332 (2)","3295005332 (2)","3295005332 (2)","3295005762 (2)","3295005762 (2)","3295005762 (2)","3295005762 (2)","3295005762 (2)","3295005762 (2)","3295005762 (2)","3295006192 (2)","3295006192 (2)","3295006192 (2)","3295006192 (2)","3295006192 (2)","3295006192 (2)","3295006192 (2)","3295006632 (2)","3295006632 (2)","3295006632 (2)","3295006632 (2)","3295006632 (2)","3295006632 (2)","3295006632 (2)","3295006632 (2)"]
[null,54,"3295005332 (2)","3295005332 (2)","3295005332 (2)","3295005332 (2)","3295005332 (2)","3295005332 (2)","3295005332 (2)","3295005332 (2)","3295005762 (2)","3295005762 (2)","3295005762 (2)","3295005762 (2)","3295005762 (2)","3295005762 (2)","3295005762 (2)","3295005762 (2)","3295006192 (2)","3295006192 (2)","3295006192 (2)","3295006192 (2)","3295006192 (2)","3295006192 (2)","3295006192 (2)","3295006632 (2)","3295006632 (2)","3295006632 (2)","3295006632 (2)","3295006632 (2)","3295006632 (2)","3295006632 (2)","3295006632 (2)"]
[null,56,"3295004902 (2)","3295004902 (2)","3295004902 (2)","3295005332 (2)","3295005332 (2)","3295005332 (2)","3295005332 (2)","3295005332 (2)","3295005332 (2)","3295005332 (2)","3295005332 (2)","3295005762 (2)","3295005762 (2)","3295005762 (2)","3295005762 (2)","3295005762 (2)","3295005762 (2)","3295005762 (2)","3295005762 (2)","3295006192 (2)","3295006192 (2)","3295006192 (2)","3295006192 (2)","3295006192 (2)","3295006192 (2)","3295006192 (2)","3295006192 (2)","3295006632 (2)","3295006632 (2)","3295006632 (2)","3295006632 (2)","3295006632 (2)","3295006632 (2)","3295006632 (2)","3295006632 (2)"]
[null,58,"3295004902 (2)","3295004902 (2)","3295004902 (2)","3295004902 (2)","3295004902 (2)","3295004902 (2)","3295005332 (2)","3295005332 (2)","3295005332 (2)","3295005332 (2)","3295005332 (2)","3295005332 (2)","3295005332 (2)","3295005332 (2)","3295005762 (2)","3295005762 (2)","3295005762 (2)","3295005762 (2)","3295005762 (2)","3295005762 (2)","3295005762 (2)","3295005762 (2)","3295005762 (2)","3295006192 (2)","3295006192 (2)","3295006192 (2)","3295006192 (2)","3295006192 (2)","3295006192 (2)","3295006192 (2)","3295006192 (2)","3295006632 (2)","3295006632 (2)","3295006632 (2)","3295006632 (2)","3295006632 (2)","3295006632 (2)","3295006632 (2)","3295006632 (2)"]
[null,60,"3295004482 (2)","3295004902 (2)","3295004902 (2)","3295004902 (2)","3295004902 (2)","3295004902 (2)","3295004902 (2)","3295004902 (2)","3295004902 (2)","3295005332 (2)","3295005332 (2)","3295005332 (2)","3295005332 (2)","3295005332 (2)","3295005332 (2)","3295005332 (2)","3295005332 (2)","3295005332 (2)","3295005762 (2)","3295005762 (2)","3295005762 (2)","3295005762 (2)","3295005762 (2)","3295005762 (2)","3295005762 (2)","3295005762 (2)","3295006192 (2)","3295006192 (2)","3295006192 (2)","3295006192 (2)","3295006192 (2)","3295006192 (2)","3295006192 (2)","3295006192 (2)","3295006192 (2)","3295006632 (2)","3295006632 (2)","3295006632 (2)","3295006632 (2)","3295006632 (2)","3295006632 (2)","3295006632 (2)","3295006632 (2)"]
[null,62,"3295004482 (2)","3295004482 (2)","3295004482 (2)","3295004902 (2)","3295004902 (2)","3295004902 (2)","3295004902 (2)","3295004902 (2)","3295004902 (2)","3295004902 (2)","3295004902 (2)","3295004902 (2)","3295005332 (2)","3295005332 (2)","3295005332 (2)","3295005332 (2)","3295005332 (2)","3295005332 (2)","3295005332 (2)","3295005332 (2)","3295005332 (2)","3295005762 (2)","3295005762 (2)","3295005762 (2)","3295005762 (2)","3295005762 (2)","3295005762 (2)","3295005762 (2)","3295005762 (2)","3295005762 (2)","3295006192 (2)","3295006192 (2)","3295006192 (2)","3295006192 (2)","3295006192 (2)","3295006192 (2)","3295006192 (2)","3295006192 (2)","3295006632 (2)","3295006632 (2)","3295006632 (2)","3295006632 (2)","3295006632 (2)","3295006632 (2)","3295006632 (2)","3295006632 (2)","3295006632 (2)"]
[null,64,"3295004482 (2)","3295004482 (2)","3295004482 (2)","3295004482 (2)","3295004482 (2)","3295004482 (2)","3295004902 (2)","3295004902 (2)","3295004902 (2)","3295004902 (2)","3295004902 (2)","3295004902 (2)","3295004902 (2)","3295004902 (2)","3295004902 (2)","3295005332 (2)","3295005332 (2)","3295005332 (2)","3295005332 (2)","3295005332 (2)","3295005332 (2)","3295005332 (2)","3295005332 (2)","3295005332 (2)","3295005762 (2)","3295005762 (2)","3295005762 (2)","3295005762 (2)","3295005762 (2)","3295005762 (2)","3295005762 (2)","3295005762 (2)","3295005762 (2)","3295006192 (2)","3295006192 (2)","3295006192 (2)","3295006192 (2)","3295006192 (2)","3295006192 (2)","3295006192 (2)","3295006192 (2)","3295006192 (2)","3295006632 (2)","3295006632 (2)","3295006632 (2)","3295006632 (2)","3295006632 (2)","3295006632 (2)","3295006632 (2)","3295006632 (2)","3295006632 (2)"]
[null,66,"3295004482 (2)","3295004482 (2)","3295004482 (2)","3295004482 (2)","3295004482 (2)","3295004482 (2)","3295004482 (2)","3295004482 (2)","3295004482 (2)","3295004902 (2)","3295004902 (2)","3295004902 (2)","3295004902 (2)","3295004902 (2)","3295004902 (2)","3295004902 (2)","3295004902 (2)","3295004902 (2)","3295005332 (2)","3295005332 (2)","3295005332 (2)","3295005332 (2)","3295005332 (2)","3295005332 (2)","3295005332 (2)","3295005332 (2)","3295005332 (2)","3295005762 (2)","3295005762 (2)","3295005762 (2)","3295005762 (2)","3295005762 (2)","3295005762 (2)","3295005762 (2)","3295005762 (2)","3295005762 (2)","3295006192 (2)","3295006192 (2)","3295006192 (2)","3295006192 (2)","3295006192 (2)","3295006192 (2)","3295006192 (2)","3295006192 (2)","3295006192 (2)","3295006192 (2)","3295006632 (2)","3295006632 (2)","3295006632 (2)","3295006632 (2)","3295006632 (2)","3295006632 (2)","3295006632 (2)","3295006632 (2)","3295006632 (2)"]
[null,68,"3295004482 (2)","3295004482 (2)","3295004482 (2)","3295004482 (2)","3295004482 (2)","3295004482 (2)","3295004482 (2)","3295004482 (2)","3295004482 (2)","3295004902 (2)","3295004902 (2)","3295004902 (2)","3295004902 (2)","3295004902 (2)","3295004902 (2)","3295004902 (2)","3295004902 (2)","3295004902 (2)","3295004902 (2)","3295005332 (2)","3295005332 (2)","3295005332 (2)","3295005332 (2)","3295005332 (2)","3295005332 (2)","3295005332 (2)","3295005332 (2)","3295005332 (2)","3295306972 (2)","3295005762 (2)","3295005762 (2)","3295005762 (2)","3295005762 (2)","3295005762 (2)","3295005762 (2)","3295005762 (2)","3295005762 (2)","3295005762 (2)","3295006192 (2)","3295006192 (2)","3295006192 (2)","3295006192 (2)","3295006192 (2)","3295006192 (2)","3295006192 (2)","3295006192 (2)","3295006192 (2)","3295006192 (2)","3295006632 (2)","3295006632 (2)","3295006632 (2)","3295006632 (2)","3295006632 (2)","3295006632 (2)","3295006632 (2)","3295006632 (2)","3295006632 (2)","3295006632 (2)","3295006632 (2)"]
[null,70,"3295305512 (2)","3295305512 (2)","3295004482 (2)","3295004482 (2)","3295004482 (2)","3295004482 (2)","3295004482 (2)","3295004482 (2)","3295004482 (2)","3295306002 (2)","3295306002 (2)","3295306002 (2)","3295004902 (2)","3295004902 (2)","3295004902 (2)","3295004902 (2)","3295004902 (2)","3295004902 (2)","3295306492 (2)","3295306492 (2)","3295306492 (2)","3295306492 (2)","3295005332 (2)","3295005332 (2)","3295005332 (2)","3295005332 (2)","3295005332 (2)","3295005332 (2)","3295306972 (2)","3295306972 (2)","3295306972 (2)","3295306972 (2)","3295005762 (2)","3295005762 (2)","3295005762 (2)","3295005762 (2)","3295005762 (2)","3295307462 (2)","3295307462 (2)","3295307462 (2)","3295307462 (2)","3295307462 (2)","3295006192 (2)","3295006192 (2)","3295006192 (2)","3295006192 (2)","3295307952 (2)","3295307952 (2)","3295307952 (2)","3295307952 (2)","3295006192 (2)","3295006192 (2)","3295006632 (2)","3295006632 (2)","3295006632 (2)","3295006632 (2)","3295006632 (2)","3295006632 (2)","3295006632 (2)","3295006632 (2)","3295006632 (2)","3295006632 (2)","3295006632 (2)"]
[null,72,"3295305032 (2)","3295305032 (2)","3295305512 (2)","3295305512 (2)","3295305512 (2)","3295004482 (2)","3295004482 (2)","3295004482 (2)","3295004482 (2)","3295305512 (2)","3295305512 (2)","3295306002 (2)","3295306002 (2)","3295306002 (2)","3295306002 (2)","3295004902 (2)","3295004902 (2)","3295004902 (2)","3295306002 (2)","3295306002 (2)","3295306492 (2)","3295306492 (2)","3295306492 (2)","3295306492 (2)","3295306492 (2)","3295306492 (2)","3295005332 (2)","3295306492 (2)","3295306972 (2)","3295306972 (2)","3295306972 (2)","3295306972 (2)","3295306972 (2)","3295306972 (2)","3295306972 (2)","3295306972 (2)","3295005762 (2)","3295307462 (2)","3295307462 (2)","3295307462 (2)","3295307462 (2)","3295307462 (2)","3295307462 (2)","3295307462 (2)","3295307462 (2)","3295307952 (2)","3295307952 (2)","3295307952 (2)","3295307952 (2)","3295307952 (2)","3295307952 (2)","3295307952 (2)","3295307952 (2)","3295307952 (2)","3295006192 (2)","3295006192 (2)","3295006192 (2)","3295006632 (2)","3295006632 (2)","3295006632 (2)","3295006632 (2)","3295006632 (2)","3295006632 (2)","3295006632 (2)","3295006632 (2)","3295006632 (2)","3295006632 (2)"]
[null,74,"3295305032 (2)","3295305032 (2)","3295305032 (2)","3295305032 (2)","3295305032 (2)","3295305512 (2)","3295305512 (2)","3295305512 (2)","3295004482 (2)","3295305512 (2)","3295305512 (2)","3295305512 (2)","3295305512 (2)","3295306002 (2)","3295306002 (2)","3295306002 (2)","3295306002 (2)","3295306002 (2)","3295306002 (2)","3295306002 (2)","3295306002 (2)","3295306002 (2)","3295306492 (2)","3295306492 (2)","3295306492 (2)","3295306492 (2)","3295306492 (2)","3295306492 (2)","3295306492 (2)","3295306492 (2)","3295306492 (2)","3295306972 (2)","3295306972 (2)","3295306972 (2)","3295306972 (2)","3295306972 (2)","3295306972 (2)","3295306972 (2)","3295306972 (2)","3295306972 (2)","3295307462 (2)","3295307462 (2)","3295307462 (2)","3295307462 (2)","3295307462 (2)","3295307462 (2)","3295307462 (2)","3295307462 (2)","3295307462 (2)","3295307952 (2)","3295307952 (2)","3295307952 (2)","3295307952 (2)","3295307952 (2)","3295307952 (2)","3295307952 (2)","3295307952 (2)","3295307952 (2)",null,null,null,"3295006632 (2)","3295006632 (2)","3295006632 (2)","3295006632 (2)","3295006632 (2)","3295006632 (2)"]
[null,76,"3295305032 (2)","3295305032 (2)","3295305032 (2)","3295305032 (2)","3295305032 (2)","3295305032 (2)","3295305032 (2)","3295305512 (2)","3295305512 (2)","3295305512 (2)","3295305512 (2)","3295305512 (2)","3295305512 (2)","3295305512 (2)","3295305512 (2)","3295305512 (2)","3295306002 (2)","3295306002 (2)","3295306002 (2)","3295306002 (2)","3295306002 (2)","3295306002 (2)","3295306002 (2)","3295306002 (2)","3295306002 (2)","3295306492 (2)","3295306492 (2)","3295306492 (2)","3295306492 (2)","3295306492 (2)","3295306492 (2)","3295306492 (2)","3295306492 (2)","3295306492 (2)","3295306972 (2)","3295306972 (2)","3295306972 (2)","3295306972 (2)","3295306972 (2)","3295306972 (2)","3295306972 (2)","3295306972 (2)","3295306972 (2)","3295307462 (2)","3295307462 (2)","3295307462 (2)","3295307462 (2)","3295307462 (2)","3295307462 (2)","3295307462 (2)","3295307462 (2)","3295307462 (2)","3295307952 (2)","3295307952 (2)","3295307952 (2)","3295307952 (2)","3295307952 (2)","3295307952 (2)","3295307952 (2)","3295307952 (2)","3295307952 (2)",null,null,null,null,"3295006632 (2)"]
[null,78,"3295305032 (2)","3295305032 (2)","3295305032 (2)","3295305032 (2)","3295305032 (2)","3295305032 (2)","3295305032 (2)","3295305032 (2)","3295305032 (2)","3295305512 (2)","3295305512 (2)","3295305512 (2)","3295305512 (2)","3295305512 (2)","3295305512 (2)","3295305512 (2)","3295305512 (2)","3295305512 (2)","3295306002 (2)","3295306002 (2)","3295306002 (2)","3295306002 (2)","3295306002 (2)","3295306002 (2)","3295306002 (2)","3295306002 (2)","3295306002 (2)","3295306002 (2)","3295306492 (2)","3295306492 (2)","3295306492 (2)","3295306492 (2)","3295306492 (2)","3295306492 (2)","3295306492 (2)","3295306492 (2)","3295306492 (2)","3295306972 (2)","3295306972 (2)","3295306972 (2)","3295306972 (2)","3295306972 (2)","3295306972 (2)","3295306972 (2)","3295306972 (2)","3295306972 (2)","3295307462 (2)","3295307462 (2)","3295307462 (2)","3295307462 (2)","3295307462 (2)","3295307462 (2)","3295307462 (2)","3295307462 (2)","3295307462 (2)","3295307462 (2)","3295307952 (2)","3295307952 (2)","3295307952 (2)","3295307952 (2)","3295307952 (2)","3295307952 (2)","3295307952 (2)","3295307952 (2)","3295307952 (2)"]
[null,80,"3295305032 (2)","3295305032 (2)","3295305032 (2)","3295305032 (2)","3295305032 (2)","3295305032 (2)","3295305032 (2)","3295305032 (2)","3295305032 (2)","3295305032 (2)","3295305512 (2)","3295305512 (2)","3295305512 (2)","3295305512 (2)","3295305512 (2)","3295305512 (2)","3295305512 (2)","3295305512 (2)","3295305512 (2)","3295305512 (2)","3295306002 (2)","3295306002 (2)","3295306002 (2)","3295306002 (2)","3295306002 (2)","3295306002 (2)","3295306002 (2)","3295306002 (2)","3295306002 (2)","3295306492 (2)","3295306492 (2)","3295306492 (2)","3295306492 (2)","3295306492 (2)","3295306492 (2)","3295306492 (2)","3295306492 (2)","3295306492 (2)","3295306492 (2)","3295306972 (2)","3295306972 (2)","3295306972 (2)","3295306972 (2)","3295306972 (2)","3295306972 (2)","3295306972 (2)","3295306972 (2)","3295306972 (2)","3295307462 (2)","3295307462 (2)","3295307462 (2)","3295307462 (2)","3295307462 (2)","3295307462 (2)","3295307462 (2)","3295307462 (2)","3295307462 (2)","3295307462 (2)","3295307952 (2)","3295307952 (2)","3295307952 (2)","3295307952 (2)","3295307952 (2)","3295307952 (2)","3295307952 (2)","3295307952 (2)","3295307952 (2)","3295307952 (2)","3295307952 (2)"]
[null,82,"3295505412 (2)","3295505412 (2)","3295305032 (2)","3295305032 (2)","3295305032 (2)","3295305032 (2)","3295305032 (2)","3295305032 (2)","3295305032 (2)","3295305032 (2)","3295505932 (2)","3295505932 (2)","3295305512 (2)","3295305512 (2)","3295305512 (2)","3295305512 (2)","3295305512 (2)","3295305512 (2)","3295305512 (2)","3295506462 (2)","3295506462 (2)","3295506462 (2)","3295306002 (2)","3295306002 (2)","3295306002 (2)","3295306002 (2)","3295306002 (2)","3295306002 (2)","3295306002 (2)","3295506982 (2)","3295506982 (2)","3295507512 (2)","3295306492 (2)","3295306492 (2)","3295306492 (2)","3295306492 (2)","3295306492 (2)","3295306492 (2)","3295507512 (2)","3295507512 (2)","3295508042 (2)","3295508042 (2)","3295306972 (2)","3295306972 (2)","3295306972 (2)","3295306972 (2)","3295306972 (2)","3295306972 (2)","3295508042 (2)","3295508572 (2)","3295508572 (2)","3295508572 (2)","3295307462 (2)","3295307462 (2)","3295307462 (2)","3295307462 (2)","3295307462 (2)","3295508572 (2)","3295307462 (2)","3295307462 (2)","3295307462 (2)","3295307462 (2)","3295307952 (2)","3295307952 (2)","3295307952 (2)","3295307952 (2)","3295307952 (2)","3295307952 (2)","3295307952 (2)","3295307952 (2)"]
[null,84,"3295505412 (2)","3295505412 (2)","3295505412 (2)","3295505412 (2)","3295305032 (2)","3295305032 (2)","3295305032 (2)","3295305032 (2)","3295305032 (2)","3295505932 (2)","3295505932 (2)","3295505932 (2)","3295505932 (2)","3295505932 (2)","3295305512 (2)","3295305512 (2)","3295305512 (2)","3295305512 (2)","3295305512 (2)","3295506462 (2)","3295506462 (2)","3295506462 (2)","3295506462 (2)","3295506462 (2)","3295506462 (2)","3295306002 (2)","3295306002 (2)","3295306002 (2)","3295506982 (2)","3295506982 (2)","3295506982 (2)","3295506982 (2)","3295506982 (2)","3295507512 (2)","3295507512 (2)","3295306492 (2)","3295306492 (2)","3295306492 (2)","3295507512 (2)","3295507512 (2)","3295507512 (2)","3295507512 (2)","3295507512 (2)","3295508042 (2)","3295508042 (2)","3295306972 (2)","3295306972 (2)","3295508042 (2)","3295508042 (2)","3295508042 (2)","3295508042 (2)","3295508042 (2)","3295508572 (2)","3295508572 (2)","3295508572 (2)","3295307462 (2)","3295307462 (2)","3295508572 (2)","3295508572 (2)","3295508572 (2)","3295508572 (2)","3295307462 (2)","3295307462 (2)","3295307462 (2)","3295307462 (2)","3295307952 (2)","3295307952 (2)","3295307952 (2)","3295307952 (2)","3295307952 (2)"]
[null,86,"3295505412 (2)","3295505412 (2)","3295505412 (2)","3295505412 (2)","3295505412 (2)","3295505412 (2)","3295305032 (2)","3295305032 (2)","3295305032 (2)","3295505932 (2)","3295505932 (2)","3295505932 (2)","3295505932 (2)","3295505932 (2)","3295505932 (2)","3295505932 (2)","3295505932 (2)","3295305512 (2)","3295506462 (2)","3295506462 (2)","3295506462 (2)","3295506462 (2)","3295506462 (2)","3295506462 (2)","3295506462 (2)","3295506462 (2)","3295506462 (2)","3295306002 (2)","3295506982 (2)","3295506982 (2)","3295506982 (2)","3295506982 (2)","3295506982 (2)","3295506982 (2)","3295506982 (2)","3295506982 (2)","3295507512 (2)","3295507512 (2)","3295507512 (2)","3295507512 (2)","3295507512 (2)","3295507512 (2)","3295507512 (2)","3295507512 (2)","3295507512 (2)","3295508042 (2)","3295508042 (2)","3295508042 (2)","3295508042 (2)","3295508042 (2)","3295508042 (2)","3295508042 (2)","3295508042 (2)","3295508042 (2)","3295508042 (2)","3295508572 (2)","3295508572 (2)","3295508572 (2)","3295508572 (2)","3295508572 (2)","3295508572 (2)","3295508572 (2)","3295508572 (2)","3295508572 (2)","3295307462 (2)","3295307462 (2)","3295307462 (2)","3295307462 (2)",null,"3295307952 (2)"]
[null,88,"3295505412 (2)","3295505412 (2)","3295505412 (2)","3295505412 (2)","3295505412 (2)","3295505412 (2)","3295505412 (2)","3295505412 (2)","3295505412 (2)","3295505412 (2)","3295505932 (2)","3295505932 (2)","3295505932 (2)","3295505932 (2)","3295505932 (2)","3295505932 (2)","3295505932 (2)","3295505932 (2)","3295505932 (2)","3295505932 (2)","3295506462 (2)","3295506462 (2)","3295506462 (2)","3295506462 (2)","3295506462 (2)","3295506462 (2)","3295506462 (2)","3295506462 (2)","3295506462 (2)","3295506982 (2)","3295506982 (2)","3295506982 (2)","3295506982 (2)","3295506982 (2)","3295506982 (2)","3295506982 (2)","3295506982 (2)","3295506982 (2)","3295506982 (2)","3295507512 (2)","3295507512 (2)","3295507512 (2)","3295507512 (2)","3295507512 (2)","3295507512 (2)","3295507512 (2)","3295507512 (2)","3295507512 (2)","3295508042 (2)","3295508042 (2)","3295508042 (2)","3295508042 (2)","3295508042 (2)","3295508042 (2)","3295508042 (2)","3295508042 (2)","3295508042 (2)","3295508042 (2)","3295508572 (2)","3295508572 (2)","3295508572 (2)","3295508572 (2)","3295508572 (2)","3295508572 (2)","3295508572 (2)","3295508572 (2)","3295508572 (2)"]
[null,90,"3296007112 (2)","3295505412 (2)","3295505412 (2)","3295505412 (2)","3295505412 (2)","3295505412 (2)","3295505412 (2)","3295505412 (2)","3295505412 (2)","3295505412 (2)","3296008382 (2)","3295505932 (2)","3295505932 (2)","3295505932 (2)","3295505932 (2)","3295505932 (2)","3295505932 (2)","3295505932 (2)","3295505932 (2)","3295505932 (2)","3296009022 (2)","3295506462 (2)","3295506462 (2)","3295506462 (2)","3295506462 (2)","3295506462 (2)","3295506462 (2)","3295506462 (2)","3295506462 (2)","3295506462 (2)","3295506982 (2)","3295506982 (2)","3295506982 (2)","3295506982 (2)","3295506982 (2)","3295506982 (2)","3295506982 (2)","3295506982 (2)","3295506982 (2)","3296010942 (2)","3295507512 (2)","3295507512 (2)","3295507512 (2)","3295507512 (2)","3295507512 (2)","3295507512 (2)","3295507512 (2)","3295507512 (2)","3295507512 (2)","3396009112 (2)","3295508042 (2)","3295508042 (2)","3295508042 (2)","3295508042 (2)","3295508042 (2)","3295508042 (2)","3295508042 (2)","3295508042 (2)","3396009612 (2)","3396009612 (2)","3295508572 (2)","3295508572 (2)","3295508572 (2)","3295508572 (2)","3295508572 (2)","3295508572 (2)","3295508572 (2)","3295508572 (2)","3295508572 (2)","3295508572 (2)"]
[null,92,"3296007112 (2)","3296007112 (2)","3296007112 (2)","3295505412 (2)","3295505412 (2)","3295505412 (2)","3295505412 (2)","3295505412 (2)","3295505412 (2)","3295505412 (2)","3296007752 (2)","3296008382 (2)","3296008382 (2)","3295505932 (2)","3295505932 (2)","3295505932 (2)","3295505932 (2)","3295505932 (2)","3295505932 (2)","3295505932 (2)","3296009022 (2)","3296009022 (2)","3296009022 (2)","3295506462 (2)","3295506462 (2)","3295506462 (2)","3295506462 (2)","3295506462 (2)","3295506462 (2)","3296009662 (2)","3296009662 (2)","3296009662 (2)","3296009662 (2)","3295506982 (2)","3295506982 (2)","3295506982 (2)","3295506982 (2)","3295506982 (2)","3295506982 (2)","3296010302 (2)","3296010302 (2)","3296010302 (2)","3296010942 (2)","3295507512 (2)","3295507512 (2)","3295507512 (2)","3295507512 (2)","3295507512 (2)","3296010942 (2)","3296010942 (2)","3396009112 (2)","3396009112 (2)","3396009112 (2)","3295508042 (2)","3295508042 (2)","3295508042 (2)","3295508042 (2)","3295508042 (2)","3396009612 (2)","3396009612 (2)","3396009612 (2)","3396009612 (2)","3396009612 (2)","3295508572 (2)","3295508572 (2)","3295508572 (2)","3295508572 (2)","3295508572 (2)","3295508572 (2)","3295508572 (2)"]
[null,94,"3296007112 (2)","3296007112 (2)","3296007112 (2)","3296007112 (2)","3296007752 (2)","3295505412 (2)","3295505412 (2)","3295505412 (2)","3295505412 (2)","3295505412 (2)","3296007752 (2)","3296007752 (2)","3296008382 (2)","3296008382 (2)","3296008382 (2)","3295505932 (2)","3295505932 (2)","3295505932 (2)","3295505932 (2)","3296008382 (2)","3296009022 (2)","3296009022 (2)","3296009022 (2)","3296009022 (2)","3296009022 (2)","3296009022 (2)","3295506462 (2)","3295506462 (2)","3295506462 (2)","3296009662 (2)","3296009662 (2)","3296009662 (2)","3296009662 (2)","3296009662 (2)","3296009662 (2)","3296009662 (2)","3295506982 (2)","3295506982 (2)","3296010302 (2)","3296010302 (2)","3296010302 (2)","3296010302 (2)","3296010302 (2)","3296010302 (2)","3296010302 (2)","3296010942 (2)","3295507512 (2)","3295507512 (2)","3296010942 (2)","3296010942 (2)","3296010942 (2)","3296010942 (2)","3296010942 (2)","3396009112 (2)","3396009112 (2)","3396009112 (2)","3295508042 (2)","3295508042 (2)","3396009112 (2)","3396009112 (2)","3396009112 (2)","3396009612 (2)","3396009612 (2)","3396009612 (2)","3396009612 (2)","3396009612 (2)","3396009612 (2)","3396009612 (2)","3396009612 (2)","3295508572 (2)"]
[null,96,"3296007112 (2)","3296007112 (2)","3296007112 (2)","3296007112 (2)","3296007112 (2)","3296007112 (2)","3296007752 (2)","3295505412 (2)","3295505412 (2)","3296007752 (2)","3296007752 (2)","3296007752 (2)","3296007752 (2)","3296007752 (2)","3296008382 (2)","3296008382 (2)","3296008382 (2)","3295505932 (2)","3295505932 (2)","3296008382 (2)","3296008382 (2)","3296008382 (2)","3296008382 (2)","3296009022 (2)","3296009022 (2)","3296009022 (2)","3296009022 (2)","3296009022 (2)","3295506462 (2)","3296009022 (2)","3296009022 (2)","3296009662 (2)","3296009662 (2)","3296009662 (2)","3296009662 (2)","3296009662 (2)","3296009662 (2)","3296009662 (2)","3296009662 (2)","3296010302 (2)","3296010302 (2)","3296010302 (2)","3296010302 (2)","3296010302 (2)","3296010302 (2)","3296010302 (2)","3296010302 (2)","3296010942 (2)","3296010942 (2)","3296010942 (2)","3296010942 (2)","3296010942 (2)","3296010942 (2)","3296010942 (2)","3296010942 (2)","3396009112 (2)","3396009112 (2)","3396009112 (2)","3396009112 (2)","3396009112 (2)","3396009112 (2)","3396009112 (2)","3396009112 (2)","3396009112 (2)","3396009612 (2)","3396009612 (2)","3396009612 (2)","3396009612 (2)","3396009612 (2)","3396009612 (2)"]
[null,98,"3296007112 (2)","3296007112 (2)","3296007112 (2)","3296007112 (2)","3296007112 (2)","3296007112 (2)","3296007112 (2)","3296007112 (2)","3296007752 (2)","3296007752 (2)","3296007752 (2)","3296007752 (2)","3296007752 (2)","3296007752 (2)","3296007752 (2)","3296007752 (2)","3296008382 (2)","3296008382 (2)","3296008382 (2)","3296008382 (2)","3296008382 (2)","3296008382 (2)","3296008382 (2)","3296008382 (2)","3296008382 (2)","3296009022 (2)","3296009022 (2)","3296009022 (2)","3296009022 (2)","3296009022 (2)","3296009022 (2)","3296009022 (2)","3296009022 (2)","3296009662 (2)","3296009662 (2)","3296009662 (2)","3296009662 (2)","3296009662 (2)","3296009662 (2)","3296009662 (2)","3296009662 (2)","3296010302 (2)","3296010302 (2)","3296010302 (2)","3296010302 (2)","3296010302 (2)","3296010302 (2)","3296010302 (2)","3296010302 (2)","3296010302 (2)","3296010942 (2)","3296010942 (2)","3296010942 (2)","3296010942 (2)","3296010942 (2)","3296010942 (2)","3296010942 (2)","3296010942 (2)","3396009112 (2)","3396009112 (2)","3396009112 (2)","3396009112 (2)","3396009112 (2)","3396009112 (2)","3396009112 (2)","3396009112 (2)","3396009112 (2)","3396009612 (2)","3396009612 (2)","3396009612 (2)"]
[null,100,"3296006482 (2)","3296007112 (2)","3296007112 (2)","3296007112 (2)","3296007112 (2)","3296007112 (2)","3296007112 (2)","3296007112 (2)","3296007112 (2)","3296007112 (2)","3296007752 (2)","3296007752 (2)","3296007752 (2)","3296007752 (2)","3296007752 (2)","3296007752 (2)","3296007752 (2)","3296007752 (2)","3296008382 (2)","3296008382 (2)","3296008382 (2)","3296008382 (2)","3296008382 (2)","3296008382 (2)","3296008382 (2)","3296008382 (2)","3296008382 (2)","3296009022 (2)","3296009022 (2)","3296009022 (2)","3296009022 (2)","3296009022 (2)","3296009022 (2)","3296009022 (2)","3296009022 (2)","3296009662 (2)","3296009662 (2)","3296009662 (2)","3296009662 (2)","3296009662 (2)","3296009662 (2)","3296009662 (2)","3296009662 (2)","3296009662 (2)","3296010302 (2)","3296010302 (2)","3296010302 (2)","3296010302 (2)","3296010302 (2)","3296010302 (2)","3296010302 (2)","3296010302 (2)","3296010942 (2)","3296010942 (2)","3296010942 (2)","3296010942 (2)","3296010942 (2)","3296010942 (2)","3296010942 (2)","3296010942 (2)","3296010942 (2)","3396009112 (2)","3396009112 (2)","3396009112 (2)","3396009112 (2)","3396009112 (2)","3396009112 (2)","3396009112 (2)","3396009112 (2)","3396009112 (2)"]
[null,102,"3296006482 (2)","3296006482 (2)","3296006482 (2)","3296007112 (2)","3296007112 (2)","3296007112 (2)","3296007112 (2)","3296007112 (2)","3296007112 (2)","3296007112 (2)","3296007112 (2)","3296007752 (2)","3296007752 (2)","3296007752 (2)","3296007752 (2)","3296007752 (2)","3296007752 (2)","3296007752 (2)","3296007752 (2)","3296007752 (2)","3296008382 (2)","3296008382 (2)","3296008382 (2)","3296008382 (2)","3296008382 (2)","3296008382 (2)","3296008382 (2)","3296008382 (2)","3296008382 (2)","3296009022 (2)","3296009022 (2)","3296009022 (2)","3296009022 (2)","3296009022 (2)","3296009022 (2)","3296009022 (2)","3296009022 (2)","3296009022 (2)","3296009662 (2)","3296009662 (2)","3296009662 (2)","3296009662 (2)","3296009662 (2)","3296009662 (2)","3296009662 (2)","3296009662 (2)","3296010302 (2)","3296010302 (2)","3296010302 (2)","3296010302 (2)","3296010302 (2)","3296010302 (2)","3296010302 (2)","3296010302 (2)","3296010302 (2)","3296010942 (2)","3296010942 (2)","3296010942 (2)","3296010942 (2)","3296010942 (2)","3296010942 (2)","3296010942 (2)","3296010942 (2)","3296010942 (2)","3396009112 (2)","3396009112 (2)","3396009112 (2)","3396009112 (2)","3396009112 (2)","3396009112 (2)"]
[null,104,"3296006482 (2)","3296006482 (2)","3296006482 (2)","3296006482 (2)","3296007112 (2)","3296007112 (2)","3296007112 (2)","3296007112 (2)","3296007112 (2)","3296007112 (2)","3296007112 (2)","3296007112 (2)","3296007112 (2)","3296007752 (2)","3296007752 (2)","3296007752 (2)","3296007752 (2)","3296007752 (2)","3296007752 (2)","3296007752 (2)","3296007752 (2)","3296007752 (2)","3296008382 (2)","3296008382 (2)","3296008382 (2)","3296008382 (2)","3296008382 (2)","3296008382 (2)","3296008382 (2)","3296008382 (2)","3296008382 (2)","3296009022 (2)","3296009022 (2)","3296009022 (2)","3296009022 (2)","3296009022 (2)","3296009022 (2)","3296009022 (2)","3296009022 (2)","3296009022 (2)","3296009662 (2)","3296009662 (2)","3296009662 (2)","3296009662 (2)","3296009662 (2)","3296009662 (2)","3296009662 (2)","3296009662 (2)","3296009662 (2)","3296010302 (2)","3296010302 (2)","3296010302 (2)","3296010302 (2)","3296010302 (2)","3296010302 (2)","3296010302 (2)","3296010302 (2)","3296010302 (2)","3296010942 (2)","3296010942 (2)","3296010942 (2)","3296010942 (2)","3296010942 (2)","3296010942 (2)","3296010942 (2)","3296010942 (2)","3296010942 (2)","3396009112 (2)","3396009112 (2)","3396009112 (2)"]
[null,106,"3296006482 (2)","3296006482 (2)","3296006482 (2)","3296006482 (2)","3296006482 (2)","3296006482 (2)","3296007112 (2)","3296007112 (2)","3296007112 (2)","3296007112 (2)","3296007112 (2)","3296007112 (2)","3296007112 (2)","3296007112 (2)","3296007112 (2)","3296007752 (2)","3296007752 (2)","3296007752 (2)","3296007752 (2)","3296007752 (2)","3296007752 (2)","3296007752 (2)","3296007752 (2)","3296007752 (2)","3296008382 (2)","3296008382 (2)","3296008382 (2)","3296008382 (2)","3296008382 (2)","3296008382 (2)","3296008382 (2)","3296008382 (2)","3296008382 (2)","3296009022 (2)","3296009022 (2)","3296009022 (2)","3296009022 (2)","3296009022 (2)","3296009022 (2)","3296009022 (2)","3296009022 (2)","3296009022 (2)","3296009662 (2)","3296009662 (2)","3296009662 (2)","3296009662 (2)","3296009662 (2)","3296009662 (2)","3296009662 (2)","3296009662 (2)","3296009662 (2)","3296010302 (2)","3296010302 (2)","3296010302 (2)","3296010302 (2)","3296010302 (2)","3296010302 (2)","3296010302 (2)","3296010302 (2)","3296010302 (2)","3296010942 (2)","3296010942 (2)","3296010942 (2)","3296010942 (2)","3296010942 (2)","3296010942 (2)","3296010942 (2)","3296010942 (2)","3296010942 (2)","3396009112 (2)"]
[null,108,"3296006482 (2)","3296006482 (2)","3296006482 (2)","3296006482 (2)","3296006482 (2)","3296006482 (2)","3296006482 (2)","3296006482 (2)","3296007112 (2)","3296007112 (2)","3296007112 (2)","3296007112 (2)","3296007112 (2)","3296007112 (2)","3296007112 (2)","3296007112 (2)","3296007112 (2)","3296007752 (2)","3296007752 (2)","3296007752 (2)","3296007752 (2)","3296007752 (2)","3296007752 (2)","3296007752 (2)","3296007752 (2)","3296007752 (2)","3296008382 (2)","3296008382 (2)","3296008382 (2)","3296008382 (2)","3296008382 (2)","3296008382 (2)","3296008382 (2)","3296008382 (2)","3296008382 (2)","3296009022 (2)","3296009022 (2)","3296009022 (2)","3296009022 (2)","3296009022 (2)","3296009022 (2)","3296009022 (2)","3296009022 (2)","3296009022 (2)","3296009662 (2)","3296009662 (2)","3296009662 (2)","3296009662 (2)","3296009662 (2)","3296009662 (2)","3296009662 (2)","3296009662 (2)","3296009662 (2)","3296009662 (2)","3296010302 (2)","3296010302 (2)","3296010302 (2)","3296010302 (2)","3296010302 (2)","3296010302 (2)","3296010302 (2)","3296010302 (2)","3296010302 (2)","3296010942 (2)","3296010942 (2)","3296010942 (2)","3296010942 (2)","3296010942 (2)","3296010942 (2)","3296010942 (2)"]
[null,110,"3296006482 (2)","3296006482 (2)","3296006482 (2)","3296006482 (2)","3296006482 (2)","3296006482 (2)","3296006482 (2)","3296006482 (2)","3296006482 (2)","3296007112 (2)","3296007112 (2)","3296007112 (2)","3296007112 (2)","3296007112 (2)","3296007112 (2)","3296007112 (2)","3296007112 (2)","3296007112 (2)","3296007112 (2)","3296007752 (2)","3296007752 (2)","3296007752 (2)","3296007752 (2)","3296007752 (2)","3296007752 (2)","3296007752 (2)","3296007752 (2)","3296007752 (2)","3296008382 (2)","3296008382 (2)","3296008382 (2)","3296008382 (2)","3296008382 (2)","3296008382 (2)","3296008382 (2)","3296008382 (2)","3296008382 (2)","3296009022 (2)","3296009022 (2)","3296009022 (2)","3296009022 (2)","3296009022 (2)","3296009022 (2)","3296009022 (2)","3296009022 (2)","3296009022 (2)","3296009022 (2)","3296009662 (2)","3296009662 (2)","3296009662 (2)","3296009662 (2)","3296009662 (2)","3296009662 (2)","3296009662 (2)","3296009662 (2)","3296009662 (2)","3296010302 (2)","3296010302 (2)","3296010302 (2)","3296010302 (2)","3296010302 (2)","3296010302 (2)","3296010302 (2)","3296010302 (2)","3296010302 (2)","3296010942 (2)","3296010942 (2)","3296010942 (2)","3296010942 (2)","3296010942 (2)"]
[null,112,"3296006482 (2)","3296006482 (2)","3296006482 (2)","3296006482 (2)","3296006482 (2)","3296006482 (2)","3296006482 (2)","3296006482 (2)","3296006482 (2)","3296006482 (2)","3296006482 (2)","3296007112 (2)","3296007112 (2)","3296007112 (2)","3296007112 (2)","3296007112 (2)","3296007112 (2)","3296007112 (2)","3296007112 (2)","3296007112 (2)","3296007752 (2)","3296007752 (2)","3296007752 (2)","3296007752 (2)","3296007752 (2)","3296007752 (2)","3296007752 (2)","3296007752 (2)","3296007752 (2)","3296007752 (2)","3296008382 (2)","3296008382 (2)","3296008382 (2)","3296008382 (2)","3296008382 (2)","3296008382 (2)","3296008382 (2)","3296008382 (2)","3296008382 (2)","3296009022 (2)","3296009022 (2)","3296009022 (2)","3296009022 (2)","3296009022 (2)","3296009022 (2)","3296009022 (2)","3296009022 (2)","3296009022 (2)","3296009022 (2)","3296009662 (2)","3296009662 (2)","3296009662 (2)","3296009662 (2)","3296009662 (2)","3296009662 (2)","3296009662 (2)","3296009662 (2)","3296009662 (2)","3296009662 (2)","3296010302 (2)","3296010302 (2)","3296010302 (2)","3296010302 (2)","3296010302 (2)","3296010302 (2)","3296010302 (2)","3296010302 (2)","3296010302 (2)","3296010942 (2)","3296010942 (2)"]
[null,114,"3296508382 (2)","3296006482 (2)","3296006482 (2)","3296006482 (2)","3296006482 (2)","3296006482 (2)","3296006482 (2)","3296006482 (2)","3296006482 (2)","3296006482 (2)","3296006482 (2)","3296007112 (2)","3296007112 (2)","3296007112 (2)","3296007112 (2)","3296007112 (2)","3296007112 (2)","3296007112 (2)","3296007112 (2)","3296007112 (2)","3296007112 (2)","3296007752 (2)","3296007752 (2)","3296007752 (2)","3296007752 (2)","3296007752 (2)","3296007752 (2)","3296007752 (2)","3296007752 (2)","3296007752 (2)","3296008382 (2)","3296008382 (2)","3296008382 (2)","3296008382 (2)","3296008382 (2)","3296008382 (2)","3296008382 (2)","3296008382 (2)","3296008382 (2)","3296008382 (2)","3296009022 (2)","3296009022 (2)","3296009022 (2)","3296009022 (2)","3296009022 (2)","3296009022 (2)","3296009022 (2)","3296009022 (2)","3296009022 (2)","3296009022 (2)","3296009662 (2)","3296009662 (2)","3296009662 (2)","3296009662 (2)","3296009662 (2)","3296009662 (2)","3296009662 (2)","3296009662 (2)","3296009662 (2)","3396511372 (2)","3296010302 (2)","3296010302 (2)","3296010302 (2)","3296010302 (2)","3296010302 (2)","3296010302 (2)","3296010302 (2)","3296010302 (2)","3296010302 (2)","3296010302 (2)"]
[null,116,"3296508382 (2)","3296508382 (2)","3296006482 (2)","3296006482 (2)","3296006482 (2)","3296006482 (2)","3296006482 (2)","3296006482 (2)","3296006482 (2)","3296006482 (2)","3296006482 (2)","3296509892 (2)","3296007112 (2)","3296007112 (2)","3296007112 (2)","3296007112 (2)","3296007112 (2)","3296007112 (2)","3296007112 (2)","3296007112 (2)","3296007112 (2)","3296510642 (2)","3296007752 (2)","3296007752 (2)","3296007752 (2)","3296007752 (2)","3296007752 (2)","3296007752 (2)","3296007752 (2)","3296007752 (2)","3296511402 (2)","3296511402 (2)","3296008382 (2)","3296008382 (2)","3296008382 (2)","3296008382 (2)","3296008382 (2)","3296008382 (2)","3296008382 (2)","3296008382 (2)","3296512162 (2)","3296512162 (2)","3296009022 (2)","3296009022 (2)","3296009022 (2)","3296009022 (2)","3296009022 (2)","3296009022 (2)","3296009022 (2)","3396510182 (2)","3396510182 (2)","3396510772 (2)","3296009662 (2)","3296009662 (2)","3296009662 (2)","3296009662 (2)","3296009662 (2)","3296009662 (2)","3296009662 (2)","3396511372 (2)","3396511372 (2)","3396511372 (2)","3296010302 (2)","3296010302 (2)","3296010302 (2)","3296010302 (2)","3296010302 (2)","3296010302 (2)","3296010302 (2)","3296010302 (2)"]
[null,118,"3296508382 (2)","3296508382 (2)","3296508382 (2)","3296508382 (2)","3296006482 (2)","3296006482 (2)","3296006482 (2)","3296006482 (2)","3296006482 (2)","3296006482 (2)","3296006482 (2)","3296509132 (2)","3296509132 (2)","3296509892 (2)","3296007112 (2)","3296007112 (2)","3296007112 (2)","3296007112 (2)","3296007112 (2)","3296007112 (2)","3296509892 (2)","3296510642 (2)","3296510642 (2)","3296510642 (2)","3296007752 (2)","3296007752 (2)","3296007752 (2)","3296007752 (2)","3296007752 (2)","3296007752 (2)","3296511402 (2)","3296511402 (2)","3296511402 (2)","3296511402 (2)","3296511402 (2)","3296008382 (2)","3296008382 (2)","3296008382 (2)","3296008382 (2)","3296008382 (2)","3296512162 (2)","3296512162 (2)","3296512162 (2)","3296512162 (2)","3296512162 (2)","3296009022 (2)","3296009022 (2)","3296009022 (2)","3296009022 (2)","3396510182 (2)","3396510182 (2)","3396510182 (2)","3396510182 (2)","3396510182 (2)","3396510772 (2)","3296009662 (2)","3296009662 (2)","3296009662 (2)","3296009662 (2)","3396510772 (2)","3396510772 (2)","3396510772 (2)","3396511372 (2)","3396511372 (2)","3396511372 (2)","3296010302 (2)","3296010302 (2)","3296010302 (2)","3396511372 (2)","3396511372 (2)"]
[null,120,"3296508382 (2)","3296508382 (2)","3296508382 (2)","3296508382 (2)","3296508382 (2)","3296006482 (2)","3296006482 (2)","3296006482 (2)","3296006482 (2)","3296006482 (2)","3296509132 (2)","3296509132 (2)","3296509132 (2)","3296509132 (2)","3296509132 (2)","3296509892 (2)","3296007112 (2)","3296007112 (2)","3296007112 (2)","3296007112 (2)","3296509892 (2)","3296509892 (2)","3296509892 (2)","3296510642 (2)","3296510642 (2)","3296510642 (2)","3296007752 (2)","3296007752 (2)","3296007752 (2)","3296007752 (2)","3296510642 (2)","3296511402 (2)","3296511402 (2)","3296511402 (2)","3296511402 (2)","3296511402 (2)","3296511402 (2)","3296008382 (2)","3296008382 (2)","3296512162 (2)","3296512162 (2)","3296512162 (2)","3296512162 (2)","3296512162 (2)","3296512162 (2)","3296512162 (2)","3296512162 (2)","3296009022 (2)","3296009022 (2)","3396510182 (2)","3396510182 (2)","3396510182 (2)","3396510182 (2)","3396510182 (2)","3396510182 (2)","3396510182 (2)","3396510772 (2)","3296009662 (2)","3296009662 (2)","3396510772 (2)","3396510772 (2)","3396510772 (2)","3396510772 (2)","3396510772 (2)","3396511372 (2)","3396511372 (2)","3396511372 (2)","3396511372 (2)","3396511372 (2)","3396511372 (2)"]
[null,122,"3296508382 (2)","3296508382 (2)","3296508382 (2)","3296508382 (2)","3296508382 (2)","3296508382 (2)","3296508382 (2)","3296006482 (2)","3296006482 (2)","3296006482 (2)","3296509132 (2)","3296509132 (2)","3296509132 (2)","3296509132 (2)","3296509132 (2)","3296509132 (2)","3296509892 (2)","3296509892 (2)","3296007112 (2)","3296007112 (2)","3296509892 (2)","3296509892 (2)","3296509892 (2)","3296509892 (2)","3296509892 (2)","3296510642 (2)","3296510642 (2)","3296510642 (2)","3296007752 (2)","3296007752 (2)","3296510642 (2)","3296510642 (2)","3296510642 (2)","3296511402 (2)","3296511402 (2)","3296511402 (2)","3296511402 (2)","3296511402 (2)","3296511402 (2)","3296511402 (2)","3296511402 (2)","3296512162 (2)","3296512162 (2)","3296512162 (2)","3296512162 (2)","3296512162 (2)","3296512162 (2)","3296512162 (2)","3296512162 (2)","3296512162 (2)","3396510182 (2)","3396510182 (2)","3396510182 (2)","3396510182 (2)","3396510182 (2)","3396510182 (2)","3396510182 (2)","3396510182 (2)","3396510772 (2)","3396510772 (2)","3396510772 (2)","3396510772 (2)","3396510772 (2)","3396510772 (2)","3396510772 (2)","3396510772 (2)","3396511372 (2)","3396511372 (2)","3396511372 (2)","3396511372 (2)"]
[null,124,"3296507632 (2)","3296508382 (2)","3296508382 (2)","3296508382 (2)","3296508382 (2)","3296508382 (2)","3296508382 (2)","3296508382 (2)","3296508382 (2)","3296006482 (2)","3296509132 (2)","3296509132 (2)","3296509132 (2)","3296509132 (2)","3296509132 (2)","3296509132 (2)","3296509132 (2)","3296509132 (2)","3296509892 (2)","3296509892 (2)","3296509892 (2)","3296509892 (2)","3296509892 (2)","3296509892 (2)","3296509892 (2)","3296509892 (2)","3296510642 (2)","3296510642 (2)","3296510642 (2)","3296510642 (2)","3296510642 (2)","3296510642 (2)","3296510642 (2)","3296510642 (2)","3296510642 (2)","3296511402 (2)","3296511402 (2)","3296511402 (2)","3296511402 (2)","3296511402 (2)","3296511402 (2)","3296511402 (2)","3296511402 (2)","3296512162 (2)","3296512162 (2)","3296512162 (2)","3296512162 (2)","3296512162 (2)","3296512162 (2)","3296512162 (2)","3296512162 (2)","3296512162 (2)","3396510182 (2)","3396510182 (2)","3396510182 (2)","3396510182 (2)","3396510182 (2)","3396510182 (2)","3396510182 (2)","3396510182 (2)","3396510772 (2)","3396510772 (2)","3396510772 (2)","3396510772 (2)","3396510772 (2)","3396510772 (2)","3396510772 (2)","3396510772 (2)","3396510772 (2)","3396511372 (2)"]
[null,126,"3296507632 (2)","3296507632 (2)","3296508382 (2)","3296508382 (2)","3296508382 (2)","3296508382 (2)","3296508382 (2)","3296508382 (2)","3296508382 (2)","3296508382 (2)","3296508382 (2)","3296509132 (2)","3296509132 (2)","3296509132 (2)","3296509132 (2)","3296509132 (2)","3296509132 (2)","3296509132 (2)","3296509132 (2)","3296509892 (2)","3296509892 (2)","3296509892 (2)","3296509892 (2)","3296509892 (2)","3296509892 (2)","3296509892 (2)","3296509892 (2)","3296509892 (2)","3296510642 (2)","3296510642 (2)","3296510642 (2)","3296510642 (2)","3296510642 (2)","3296510642 (2)","3296510642 (2)","3296510642 (2)","3296511402 (2)","3296511402 (2)","3296511402 (2)","3296511402 (2)","3296511402 (2)","3296511402 (2)","3296511402 (2)","3296511402 (2)","3296511402 (2)","3296512162 (2)","3296512162 (2)","3296512162 (2)","3296512162 (2)","3296512162 (2)","3296512162 (2)","3296512162 (2)","3296512162 (2)","3296512162 (2)","3396510182 (2)","3396510182 (2)","3396510182 (2)","3396510182 (2)","3396510182 (2)","3396510182 (2)","3396510182 (2)","3396510182 (2)","3396510772 (2)","3396510772 (2)","3396510772 (2)","3396510772 (2)","3396510772 (2)","3396510772 (2)","3396510772 (2)","3396510772 (2)"]
[null,128,"3296507632 (2)","3296507632 (2)","3296507632 (2)","3296508382 (2)","3296508382 (2)","3296508382 (2)","3296508382 (2)","3296508382 (2)","3296508382 (2)","3296508382 (2)","3296508382 (2)","3296508382 (2)","3296509132 (2)","3296509132 (2)","3296509132 (2)","3296509132 (2)","3296509132 (2)","3296509132 (2)","3296509132 (2)","3296509132 (2)","3296509132 (2)","3296509892 (2)","3296509892 (2)","3296509892 (2)","3296509892 (2)","3296509892 (2)","3296509892 (2)","3296509892 (2)","3296509892 (2)","3296509892 (2)","3296510642 (2)","3296510642 (2)","3296510642 (2)","3296510642 (2)","3296510642 (2)","3296510642 (2)","3296510642 (2)","3296510642 (2)","3296511402 (2)","3296511402 (2)","3296511402 (2)","3296511402 (2)","3296511402 (2)","3296511402 (2)","3296511402 (2)","3296511402 (2)","3296511402 (2)","3296512162 (2)","3296512162 (2)","3296512162 (2)","3296512162 (2)","3296512162 (2)","3296512162 (2)","3296512162 (2)","3296512162 (2)","3296512162 (2)","3396510182 (2)","3396510182 (2)","3396510182 (2)","3396510182 (2)","3396510182 (2)","3396510182 (2)","3396510182 (2)","3396510182 (2)","3396510182 (2)","3396510772 (2)","3396510772 (2)","3396510772 (2)","3396510772 (2)","3396510772 (2)"]
[null,130,"3296507632 (2)","3296507632 (2)","3296507632 (2)","3296507632 (2)","3296507632 (2)","3296508382 (2)","3296508382 (2)","3296508382 (2)","3296508382 (2)","3296508382 (2)","3296508382 (2)","3296508382 (2)","3296508382 (2)","3296509132 (2)","3296509132 (2)","3296509132 (2)","3296509132 (2)","3296509132 (2)","3296509132 (2)","3296509132 (2)","3296509132 (2)","3296509132 (2)","3296509892 (2)","3296509892 (2)","3296509892 (2)","3296509892 (2)","3296509892 (2)","3296509892 (2)","3296509892 (2)","3296509892 (2)","3296509892 (2)","3296510642 (2)","3296510642 (2)","3296510642 (2)","3296510642 (2)","3296510642 (2)","3296510642 (2)","3296510642 (2)","3296510642 (2)","3296510642 (2)","3296511402 (2)","3296511402 (2)","3296511402 (2)","3296511402 (2)","3296511402 (2)","3296511402 (2)","3296511402 (2)","3296511402 (2)","3296511402 (2)","3296512162 (2)","3296512162 (2)","3296512162 (2)","3296512162 (2)","3296512162 (2)","3296512162 (2)","3296512162 (2)","3296512162 (2)","3296512162 (2)","3396510182 (2)","3396510182 (2)","3396510182 (2)","3396510182 (2)","3396510182 (2)","3396510182 (2)","3396510182 (2)","3396510182 (2)","3396510182 (2)","3396510772 (2)","3396510772 (2)","3396510772 (2)"]
[null,132,"3296507632 (2)","3296507632 (2)","3296507632 (2)","3296507632 (2)","3296507632 (2)","3296507632 (2)","3296508382 (2)","3296508382 (2)","3296508382 (2)","3296508382 (2)","3296508382 (2)","3296508382 (2)","3296508382 (2)","3296508382 (2)","3296508382 (2)","3296509132 (2)","3296509132 (2)","3296509132 (2)","3296509132 (2)","3296509132 (2)","3296509132 (2)","3296509132 (2)","3296509132 (2)","3296509132 (2)","3296509892 (2)","3296509892 (2)","3296509892 (2)","3296509892 (2)","3296509892 (2)","3296509892 (2)","3296509892 (2)","3296509892 (2)","3296509892 (2)","3296510642 (2)","3296510642 (2)","3296510642 (2)","3296510642 (2)","3296510642 (2)","3296510642 (2)","3296510642 (2)","3296510642 (2)","3296510642 (2)","3296511402 (2)","3296511402 (2)","3296511402 (2)","3296511402 (2)","3296511402 (2)","3296511402 (2)","3296511402 (2)","3296511402 (2)","3296511402 (2)","3296512162 (2)","3296512162 (2)","3296512162 (2)","3296512162 (2)","3296512162 (2)","3296512162 (2)","3296512162 (2)","3296512162 (2)","3296512162 (2)","3396510182 (2)","3396510182 (2)","3396510182 (2)","3396510182 (2)","3396510182 (2)","3396510182 (2)","3396510182 (2)","3396510182 (2)","3396510182 (2)","3396510772 (2)"]
[null,134,"3296507632 (2)","3296507632 (2)","3296507632 (2)","3296507632 (2)","3296507632 (2)","3296507632 (2)","3296507632 (2)","3296508382 (2)","3296508382 (2)","3296508382 (2)","3296508382 (2)","3296508382 (2)","3296508382 (2)","3296508382 (2)","3296508382 (2)","3296508382 (2)","3296509132 (2)","3296509132 (2)","3296509132 (2)","3296509132 (2)","3296509132 (2)","3296509132 (2)","3296509132 (2)","3296509132 (2)","3296509132 (2)","3296509892 (2)","3296509892 (2)","3296509892 (2)","3296509892 (2)","3296509892 (2)","3296509892 (2)","3296509892 (2)","3296509892 (2)","3296509892 (2)","3296509892 (2)","3296510642 (2)","3296510642 (2)","3296510642 (2)","3296510642 (2)","3296510642 (2)","3296510642 (2)","3296510642 (2)","3296510642 (2)","3296510642 (2)","3296511402 (2)","3296511402 (2)","3296511402 (2)","3296511402 (2)","3296511402 (2)","3296511402 (2)","3296511402 (2)","3296511402 (2)","3296511402 (2)","3296512162 (2)","3296512162 (2)","3296512162 (2)","3296512162 (2)","3296512162 (2)","3296512162 (2)","3296512162 (2)","3296512162 (2)","3296512162 (2)","3396510182 (2)","3396510182 (2)","3396510182 (2)","3396510182 (2)","3396510182 (2)","3396510182 (2)","3396510182 (2)","3396510182 (2)"]
[null,136,"3296507632 (2)","3296507632 (2)","3296507632 (2)","3296507632 (2)","3296507632 (2)","3296507632 (2)","3296507632 (2)","3296507632 (2)","3296508382 (2)","3296508382 (2)","3296508382 (2)","3296508382 (2)","3296508382 (2)","3296508382 (2)","3296508382 (2)","3296508382 (2)","3296508382 (2)","3296508382 (2)","3296509132 (2)","3296509132 (2)","3296509132 (2)","3296509132 (2)","3296509132 (2)","3296509132 (2)","3296509132 (2)","3296509132 (2)","3296509132 (2)","3296509892 (2)","3296509892 (2)","3296509892 (2)","3296509892 (2)","3296509892 (2)","3296509892 (2)","3296509892 (2)","3296509892 (2)","3296509892 (2)","3296510642 (2)","3296510642 (2)","3296510642 (2)","3296510642 (2)","3296510642 (2)","3296510642 (2)","3296510642 (2)","3296510642 (2)","3296510642 (2)","3296510642 (2)","3296511402 (2)","3296511402 (2)","3296511402 (2)","3296511402 (2)","3296511402 (2)","3296511402 (2)","3296511402 (2)","3296511402 (2)","3296511402 (2)","3296512162 (2)","3296512162 (2)","3296512162 (2)","3296512162 (2)","3296512162 (2)","3296512162 (2)","3296512162 (2)","3296512162 (2)","3296512162 (2)","3396510182 (2)","3396510182 (2)","3396510182 (2)","3396510182 (2)","3396510182 (2)","3396510182 (2)"]
[null,138,"3296507632 (2)","3296507632 (2)","3296507632 (2)","3296507632 (2)","3296507632 (2)","3296507632 (2)","3296507632 (2)","3296507632 (2)","3296507632 (2)","3296507632 (2)","3296508382 (2)","3296508382 (2)","3296508382 (2)","3296508382 (2)","3296508382 (2)","3296508382 (2)","3296508382 (2)","3296508382 (2)","3296508382 (2)","3296509132 (2)","3296509132 (2)","3296509132 (2)","3296509132 (2)","3296509132 (2)","3296509132 (2)","3296509132 (2)","3296509132 (2)","3296509132 (2)","3296509132 (2)","3296509892 (2)","3296509892 (2)","3296509892 (2)","3296509892 (2)","3296509892 (2)","3296509892 (2)","3296509892 (2)","3296509892 (2)","3296509892 (2)","3296510642 (2)","3296510642 (2)","3296510642 (2)","3296510642 (2)","3296510642 (2)","3296510642 (2)","3296510642 (2)","3296510642 (2)","3296510642 (2)","3296511402 (2)","3296511402 (2)","3296511402 (2)","3296511402 (2)","3296511402 (2)","3296511402 (2)","3296511402 (2)","3296511402 (2)","3296511402 (2)","3296511402 (2)","3296512162 (2)","3296512162 (2)","3296512162 (2)","3296512162 (2)","3296512162 (2)","3296512162 (2)","3296512162 (2)","3296512162 (2)","3296512162 (2)","3396510182 (2)","3396510182 (2)","3396510182 (2)","3396510182 (2)"]
[null,140,"3296507632 (2)","3296507632 (2)","3296507632 (2)","3296507632 (2)","3296507632 (2)","3296507632 (2)","3296507632 (2)","3296507632 (2)","3296507632 (2)","3296507632 (2)","3296507632 (2)","3296508382 (2)","3296508382 (2)","3296508382 (2)","3296508382 (2)","3296508382 (2)","3296508382 (2)","3296508382 (2)","3296508382 (2)","3296508382 (2)","3296508382 (2)","3296509132 (2)","3296509132 (2)","3296509132 (2)","3296509132 (2)","3296509132 (2)","3296509132 (2)","3296509132 (2)","3296509132 (2)","3296509132 (2)","3296509892 (2)","3296509892 (2)","3296509892 (2)","3296509892 (2)","3296509892 (2)","3296509892 (2)","3296509892 (2)","3296509892 (2)","3296509892 (2)","3296509892 (2)","3296510642 (2)","3296510642 (2)","3296510642 (2)","3296510642 (2)","3296510642 (2)","3296510642 (2)","3296510642 (2)","3296510642 (2)","3296510642 (2)","3296511402 (2)","3296511402 (2)","3296511402 (2)","3296511402 (2)","3296511402 (2)","3296511402 (2)","3296511402 (2)","3296511402 (2)","3296511402 (2)","3296511402 (2)","3296512162 (2)","3296512162 (2)","3296512162 (2)","3296512162 (2)","3296512162 (2)","3296512162 (2)","3296512162 (2)","3296512162 (2)","3296512162 (2)","3396510182 (2)","3396510182 (2)"]
[null,142,"3296507632 (2)","3296507632 (2)","3296507632 (2)","3296507632 (2)","3296507632 (2)","3296507632 (2)","3296507632 (2)","3296507632 (2)","3296507632 (2)","3296507632 (2)","3296507632 (2)","3296507632 (2)","3296508382 (2)","3296508382 (2)","3296508382 (2)","3296508382 (2)","3296508382 (2)","3296508382 (2)","3296508382 (2)","3296508382 (2)","3296508382 (2)","3296508382 (2)","3296509132 (2)","3296509132 (2)","3296509132 (2)","3296509132 (2)","3296509132 (2)","3296509132 (2)","3296509132 (2)","3296509132 (2)","3296509132 (2)","3296509892 (2)","3296509892 (2)","3296509892 (2)","3296509892 (2)","3296509892 (2)","3296509892 (2)","3296509892 (2)","3296509892 (2)","3296509892 (2)","3296509892 (2)","3296510642 (2)","3296510642 (2)","3296510642 (2)","3296510642 (2)","3296510642 (2)","3296510642 (2)","3296510642 (2)","3296510642 (2)","3296510642 (2)","3296510642 (2)","3296511402 (2)","3296511402 (2)","3296511402 (2)","3296511402 (2)","3296511402 (2)","3296511402 (2)","3296511402 (2)","3296511402 (2)","3296511402 (2)","3296512162 (2)","3296512162 (2)","3296512162 (2)","3296512162 (2)","3296512162 (2)","3296512162 (2)","3296512162 (2)","3296512162 (2)","3296512162 (2)","3296512162 (2)"]
[null,144,"3397008372 (2)","3397008372 (2)","3296507632 (2)","3296507632 (2)","3296507632 (2)","3296507632 (2)","3296507632 (2)","3296507632 (2)","3296507632 (2)","3296507632 (2)","3296507632 (2)","3296507632 (2)","3296508382 (2)","3296508382 (2)","3296508382 (2)","3296508382 (2)","3296508382 (2)","3296508382 (2)","3296508382 (2)","3296508382 (2)","3296508382 (2)","3397009752 (2)","3296509132 (2)","3296509132 (2)","3296509132 (2)","3296509132 (2)","3296509132 (2)","3296509132 (2)","3296509132 (2)","3296509132 (2)","3296509132 (2)","3397010442 (2)","3296509892 (2)","3296509892 (2)","3296509892 (2)","3296509892 (2)","3296509892 (2)","3296509892 (2)","3296509892 (2)","3296509892 (2)","3296509892 (2)","3397011132 (2)","3296510642 (2)","3296510642 (2)","3296510642 (2)","3296510642 (2)","3296510642 (2)","3296510642 (2)","3296510642 (2)","3296510642 (2)","3397011832 (2)","3397011832 (2)","3296511402 (2)","3296511402 (2)","3296511402 (2)","3296511402 (2)","3296511402 (2)","3296511402 (2)","3296511402 (2)","3296511402 (2)","3296511402 (2)","3296511402 (2)","3296512162 (2)","3296512162 (2)","3296512162 (2)","3296512162 (2)","3296512162 (2)","3296512162 (2)","3296512162 (2)","3296512162 (2)"]
[null,146,"3295305032 (4)","3295305032 (4)","3397008372 (2)","3296507632 (2)","3296507632 (2)","3296507632 (2)","3296507632 (2)","3296507632 (2)","3296507632 (2)","3296507632 (2)","3296507632 (2)","3296507632 (2)","3397008372 (2)","3296508382 (2)","3296508382 (2)","3296508382 (2)","3296508382 (2)","3296508382 (2)","3296508382 (2)","3296508382 (2)","3296508382 (2)","3397009752 (2)","3397009752 (2)","3296509132 (2)","3296509132 (2)","3296509132 (2)","3296509132 (2)","3296509132 (2)","3296509132 (2)","3296509132 (2)","3296509132 (2)","3397010442 (2)","3397010442 (2)","3397010442 (2)","3296509892 (2)","3296509892 (2)","3296509892 (2)","3296509892 (2)","3296509892 (2)","3296509892 (2)","3296509892 (2)","3397011132 (2)","3397011132 (2)","3397011132 (2)","3296510642 (2)","3296510642 (2)","3296510642 (2)","3296510642 (2)","3296510642 (2)","3296510642 (2)","3397011832 (2)","3397011832 (2)","3397011832 (2)","3397011832 (2)","3296511402 (2)","3296511402 (2)","3296511402 (2)","3296511402 (2)","3296511402 (2)","3296511402 (2)","3397012522 (2)","3397012522 (2)","3296511402 (2)","3296511402 (2)","3296512162 (2)","3296512162 (2)","3296512162 (2)","3296512162 (2)","3296512162 (2)","3296512162 (2)"]
[null,148,"3295305032 (4)","3295305032 (4)","3295305032 (4)","3397008372 (2)","3296507632 (2)","3296507632 (2)","3296507632 (2)","3296507632 (2)","3296507632 (2)","3296507632 (2)","3296507632 (2)","3397008372 (2)","3397008372 (2)","3397008372 (2)","3397008372 (2)","3296508382 (2)","3296508382 (2)","3296508382 (2)","3296508382 (2)","3296508382 (2)","3296508382 (2)","3397009062 (2)","3397009062 (2)","3397009752 (2)","3397009752 (2)","3296509132 (2)","3296509132 (2)","3296509132 (2)","3296509132 (2)","3296509132 (2)","3296509132 (2)","3397010442 (2)","3397010442 (2)","3397010442 (2)","3397010442 (2)","3296509892 (2)","3296509892 (2)","3296509892 (2)","3296509892 (2)","3296509892 (2)","3397011132 (2)","3397011132 (2)","3397011132 (2)","3397011132 (2)","3397011132 (2)","3296510642 (2)","3296510642 (2)","3296510642 (2)","3296510642 (2)","3296510642 (2)","3397011832 (2)","3397011832 (2)","3397011832 (2)","3397011832 (2)","3397011832 (2)","3397011832 (2)","3296511402 (2)","3296511402 (2)","3296511402 (2)","3296511402 (2)","3397012522 (2)","3397012522 (2)","3397012522 (2)","3397012522 (2)","3296511402 (2)","3296511402 (2)","3296512162 (2)","3296512162 (2)","3296512162 (2)","3296512162 (2)"]
[null,150,"3295305032 (4)","3295305032 (4)","3295305032 (4)","3295305032 (4)","3397008372 (2)","3397008372 (2)","3296507632 (2)","3296507632 (2)","3296507632 (2)","3296507632 (2)","3296507632 (2)","3397008372 (2)","3397008372 (2)","3397008372 (2)","3397008372 (2)","3397008372 (2)","3296508382 (2)","3296508382 (2)","3296508382 (2)","3296508382 (2)","3296508382 (2)","3397009062 (2)","3397009062 (2)","3397009062 (2)","3397009752 (2)","3397009752 (2)","3397009752 (2)","3296509132 (2)","3296509132 (2)","3296509132 (2)","3397009752 (2)","3397009752 (2)","3397009752 (2)","3397010442 (2)","3397010442 (2)","3397010442 (2)","3397010442 (2)","3296509892 (2)","3296509892 (2)","3296509892 (2)","3397010442 (2)","3397011132 (2)","3397011132 (2)","3397011132 (2)","3397011132 (2)","3397011132 (2)","3397011132 (2)","3296510642 (2)","3296510642 (2)","3296510642 (2)","3397011832 (2)","3397011832 (2)","3397011832 (2)","3397011832 (2)","3397011832 (2)","3397011832 (2)","3397011832 (2)","3397011832 (2)","3296511402 (2)","3296511402 (2)","3397012522 (2)","3397012522 (2)","3397012522 (2)","3397012522 (2)","3397012522 (2)","3397012522 (2)","3296511402 (2)","3296511402 (2)","3296512162 (2)","3296512162 (2)"]
[null,152,"3295305032 (4)","3295305032 (4)","3295305032 (4)","3295305032 (4)","3295305032 (4)","3397008372 (2)","3397008372 (2)","3296507632 (2)","3296507632 (2)","3296507632 (2)","3296507632 (2)","3397008372 (2)","3397008372 (2)","3397008372 (2)","3397008372 (2)","3397008372 (2)","3397008372 (2)","3397009062 (2)","3296508382 (2)","3296508382 (2)","3296508382 (2)","3397009062 (2)","3397009062 (2)","3397009062 (2)","3397009062 (2)","3397009062 (2)","3397009752 (2)","3397009752 (2)","3296509132 (2)","3296509132 (2)","3397009752 (2)","3397009752 (2)","3397009752 (2)","3397009752 (2)","3397010442 (2)","3397010442 (2)","3397010442 (2)","3397010442 (2)","3397010442 (2)","3296509892 (2)","3397010442 (2)","3397010442 (2)","3397011132 (2)","3397011132 (2)","3397011132 (2)","3397011132 (2)","3397011132 (2)","3397011132 (2)","3397011132 (2)","3296510642 (2)","3397011132 (2)","3397011832 (2)","3397011832 (2)","3397011832 (2)","3397011832 (2)","3397011832 (2)","3397011832 (2)","3397011832 (2)","3397011832 (2)","3397012522 (2)","3397012522 (2)","3397012522 (2)","3397012522 (2)","3397012522 (2)","3397012522 (2)","3397012522 (2)","3397012522 (2)","3397012522 (2)","3296511402 (2)","3296511402 (2)"]
[null,154,"3295305032 (4)","3295305032 (4)","3295305032 (4)","3295305032 (4)","3295305032 (4)","3295305032 (4)","3295305032 (4)","3397008372 (2)","3296507632 (2)","3296507632 (2)","3296507632 (2)","3397008372 (2)","3397008372 (2)","3397008372 (2)","3397008372 (2)","3397008372 (2)","3397008372 (2)","3397008372 (2)","3397009062 (2)","3296508382 (2)","3397009062 (2)","3397009062 (2)","3397009062 (2)","3397009062 (2)","3397009062 (2)","3397009062 (2)","3397009062 (2)","3397009752 (2)","3397009752 (2)","3397009752 (2)","3397009752 (2)","3397009752 (2)","3397009752 (2)","3397009752 (2)","3397009752 (2)","3397010442 (2)","3397010442 (2)","3397010442 (2)","3397010442 (2)","3397010442 (2)","3397010442 (2)","3397010442 (2)","3397010442 (2)","3397010442 (2)","3397011132 (2)","3397011132 (2)","3397011132 (2)","3397011132 (2)","3397011132 (2)","3397011132 (2)","3397011132 (2)","3397011132 (2)","3397011132 (2)","3397011832 (2)","3397011832 (2)","3397011832 (2)","3397011832 (2)","3397011832 (2)","3397011832 (2)","3397011832 (2)","3397011832 (2)","3397012522 (2)","3397012522 (2)","3397012522 (2)","3397012522 (2)","3397012522 (2)","3397012522 (2)","3397012522 (2)","3397012522 (2)","3397012522 (2)"]
[null,156,"3295305032 (4)","3295305032 (4)","3295305032 (4)","3295305032 (4)","3295305032 (4)","3295305032 (4)","3295305032 (4)","3295305032 (4)","3397008372 (2)","3397008372 (2)","3397008372 (2)","3397008372 (2)","3397008372 (2)","3397008372 (2)","3397008372 (2)","3397008372 (2)","3397008372 (2)","3397008372 (2)","3397008372 (2)","3397008372 (2)","3397009062 (2)","3397009062 (2)","3397009062 (2)","3397009062 (2)","3397009062 (2)","3397009062 (2)","3397009062 (2)","3397009062 (2)","3397009752 (2)","3397009752 (2)","3397009752 (2)","3397009752 (2)","3397009752 (2)","3397009752 (2)","3397009752 (2)","3397009752 (2)","3397009752 (2)","3397010442 (2)","3397010442 (2)","3397010442 (2)","3397010442 (2)","3397010442 (2)","3397010442 (2)","3397010442 (2)","3397010442 (2)","3397010442 (2)","3397011132 (2)","3397011132 (2)","3397011132 (2)","3397011132 (2)","3397011132 (2)","3397011132 (2)","3397011132 (2)","3397011132 (2)","3397011832 (2)","3397011832 (2)","3397011832 (2)","3397011832 (2)","3397011832 (2)","3397011832 (2)","3397011832 (2)","3397011832 (2)","3397011832 (2)","3397012522 (2)","3397012522 (2)","3397012522 (2)","3397012522 (2)","3397012522 (2)","3397012522 (2)","3397012522 (2)"]
[null,158,"3295305032 (4)","3295305032 (4)","3295305032 (4)","3295305032 (4)","3295305032 (4)","3295305032 (4)","3295305032 (4)","3295305032 (4)","3295305032 (4)","3397008372 (2)","3397008372 (2)","3397008372 (2)","3397008372 (2)","3397008372 (2)","3397008372 (2)","3397008372 (2)","3397008372 (2)","3397008372 (2)","3397008372 (2)","3397008372 (2)","3397008372 (2)","3397009062 (2)","3397009062 (2)","3397009062 (2)","3397009062 (2)","3397009062 (2)","3397009062 (2)","3397009062 (2)","3397009062 (2)","3397009062 (2)","3397009752 (2)","3397009752 (2)","3397009752 (2)","3397009752 (2)","3397009752 (2)","3397009752 (2)","3397009752 (2)","3397009752 (2)","3397010442 (2)","3397010442 (2)","3397010442 (2)","3397010442 (2)","3397010442 (2)","3397010442 (2)","3397010442 (2)","3397010442 (2)","3397010442 (2)","3397011132 (2)","3397011132 (2)","3397011132 (2)","3397011132 (2)","3397011132 (2)","3397011132 (2)","3397011132 (2)","3397011132 (2)","3397011132 (2)","3397011832 (2)","3397011832 (2)","3397011832 (2)","3397011832 (2)","3397011832 (2)","3397011832 (2)","3397011832 (2)","3397011832 (2)","3397011832 (2)","3397012522 (2)","3397012522 (2)","3397012522 (2)","3397012522 (2)","3397012522 (2)"]
[null,160,"3295305032 (4)","3295305032 (4)","3295305032 (4)","3295305032 (4)","3295305032 (4)","3295305032 (4)","3295305032 (4)","3295305032 (4)","3295305032 (4)","3295305032 (4)","3295305512 (4)","3397008372 (2)","3397008372 (2)","3397008372 (2)","3397008372 (2)","3397008372 (2)","3397008372 (2)","3397008372 (2)","3397008372 (2)","3397008372 (2)","3397008372 (2)","3397008372 (2)","3397009062 (2)","3397009062 (2)","3397009062 (2)","3397009062 (2)","3397009062 (2)","3397009062 (2)","3397009062 (2)","3397009062 (2)","3397009062 (2)","3397009752 (2)","3397009752 (2)","3397009752 (2)","3397009752 (2)","3397009752 (2)","3397009752 (2)","3397009752 (2)","3397009752 (2)","3397009752 (2)","3397010442 (2)","3397010442 (2)","3397010442 (2)","3397010442 (2)","3397010442 (2)","3397010442 (2)","3397010442 (2)","3397010442 (2)","3397010442 (2)","3397011132 (2)","3397011132 (2)","3397011132 (2)","3397011132 (2)","3397011132 (2)","3397011132 (2)","3397011132 (2)","3397011132 (2)","3397011132 (2)","3397011832 (2)","3397011832 (2)","3397011832 (2)","3397011832 (2)","3397011832 (2)","3397011832 (2)","3397011832 (2)","3397011832 (2)","3397011832 (2)","3397012522 (2)","3397012522 (2)","3397012522 (2)"]
[null,162,"3295505412 (4)","3295305032 (4)","3295305032 (4)","3295305032 (4)","3295305032 (4)","3295305032 (4)","3295305032 (4)","3295305032 (4)","3295305032 (4)","3295305032 (4)","3295305512 (4)","3295305512 (4)","3397008372 (2)","3397008372 (2)","3397008372 (2)","3397008372 (2)","3397008372 (2)","3397008372 (2)","3397008372 (2)","3397008372 (2)","3397008372 (2)","3397008372 (2)","3397008372 (2)","3397009062 (2)","3397009062 (2)","3397009062 (2)","3397009062 (2)","3397009062 (2)","3397009062 (2)","3397009062 (2)","3397009062 (2)","3397009062 (2)","3397009752 (2)","3397009752 (2)","3397009752 (2)","3397009752 (2)","3397009752 (2)","3397009752 (2)","3397009752 (2)","3397009752 (2)","3397009752 (2)","3397010442 (2)","3397010442 (2)","3397010442 (2)","3397010442 (2)","3397010442 (2)","3397010442 (2)","3397010442 (2)","3397010442 (2)","3397010442 (2)","3397011132 (2)","3397011132 (2)","3397011132 (2)","3397011132 (2)","3397011132 (2)","3397011132 (2)","3397011132 (2)","3397011132 (2)","3397011132 (2)","3397011832 (2)","3397011832 (2)","3397011832 (2)","3397011832 (2)","3397011832 (2)","3397011832 (2)","3397011832 (2)","3397011832 (2)","3397011832 (2)","3397012522 (2)","3397012522 (2)"]
[null,164,"3295505412 (4)","3295505412 (4)","3295305032 (4)","3295305032 (4)","3295305032 (4)","3295305032 (4)","3295305032 (4)","3295305032 (4)","3295305032 (4)","3295305032 (4)","3295505932 (4)","3295505932 (4)","3295305512 (4)","3397008372 (2)","3397008372 (2)","3397008372 (2)","3397008372 (2)","3397008372 (2)","3397008372 (2)","3397008372 (2)","3397008372 (2)","3397008372 (2)","3397008372 (2)","3397008372 (2)","3397008372 (2)","3397009062 (2)","3397009062 (2)","3397009062 (2)","3397009062 (2)","3397009062 (2)","3397009062 (2)","3397009062 (2)","3397009062 (2)","3397009062 (2)","3397009752 (2)","3397009752 (2)","3397009752 (2)","3397009752 (2)","3397009752 (2)","3397009752 (2)","3397009752 (2)","3397009752 (2)","3397009752 (2)","3397010442 (2)","3397010442 (2)","3397010442 (2)","3397010442 (2)","3397010442 (2)","3397010442 (2)","3397010442 (2)","3397010442 (2)","3397010442 (2)","3397011132 (2)","3397011132 (2)","3397011132 (2)","3397011132 (2)","3397011132 (2)","3397011132 (2)","3397011132 (2)","3397011132 (2)","3397011132 (2)","3397011832 (2)","3397011832 (2)","3397011832 (2)","3397011832 (2)","3397011832 (2)","3397011832 (2)","3397011832 (2)","3397011832 (2)","3397011832 (2)"]
[null,166,"3295505412 (4)","3295505412 (4)","3295505412 (4)","3295305032 (4)","3295305032 (4)","3295305032 (4)","3295305032 (4)","3295305032 (4)","3295305032 (4)","3295305032 (4)","3295505932 (4)","3295505932 (4)","3295505932 (4)","3295305512 (4)","3397008372 (2)","3397008372 (2)","3397008372 (2)","3397008372 (2)","3397008372 (2)","3397008372 (2)","3397008372 (2)","3397008372 (2)","3397008372 (2)","3397008372 (2)","3397008372 (2)","3397008372 (2)","3397009062 (2)","3397009062 (2)","3397009062 (2)","3397009062 (2)","3397009062 (2)","3397009062 (2)","3397009062 (2)","3397009062 (2)","3397009062 (2)","3397009752 (2)","3397009752 (2)","3397009752 (2)","3397009752 (2)","3397009752 (2)","3397009752 (2)","3397009752 (2)","3397009752 (2)","3397009752 (2)","3397010442 (2)","3397010442 (2)","3397010442 (2)","3397010442 (2)","3397010442 (2)","3397010442 (2)","3397010442 (2)","3397010442 (2)","3397010442 (2)","3397010442 (2)","3397011132 (2)","3397011132 (2)","3397011132 (2)","3397011132 (2)","3397011132 (2)","3397011132 (2)","3397011132 (2)","3397011132 (2)","3397011132 (2)","3397011832 (2)","3397011832 (2)","3397011832 (2)","3397011832 (2)","3397011832 (2)","3397011832 (2)","3397011832 (2)"]
[null,168,"3295505412 (4)","3295505412 (4)","3295505412 (4)","3295505412 (4)","3295305032 (4)","3295305032 (4)","3295305032 (4)","3295305032 (4)","3295305032 (4)","3295505932 (4)","3295505932 (4)","3295505932 (4)","3295505932 (4)","3295505932 (4)","3295305512 (4)","3295305512 (4)","3397008372 (2)","3397008372 (2)","3397008372 (2)","3397008372 (2)","3397008372 (2)","3397008372 (2)","3397008372 (2)","3397008372 (2)","3397008372 (2)","3397008372 (2)","3397008372 (2)","3397009062 (2)","3397009062 (2)","3397009062 (2)","3397009062 (2)","3397009062 (2)","3397009062 (2)","3397009062 (2)","3397009062 (2)","3397009062 (2)","3397009062 (2)","3397009752 (2)","3397009752 (2)","3397009752 (2)","3397009752 (2)","3397009752 (2)","3397009752 (2)","3397009752 (2)","3397009752 (2)","3397009752 (2)","3397010442 (2)","3397010442 (2)","3397010442 (2)","3397010442 (2)","3397010442 (2)","3397010442 (2)","3397010442 (2)","3397010442 (2)","3397010442 (2)","3397011132 (2)","3397011132 (2)","3397011132 (2)","3397011132 (2)","3397011132 (2)","3397011132 (2)","3397011132 (2)","3397011132 (2)","3397011132 (2)","3397011832 (2)","3397011832 (2)","3397011832 (2)","3397011832 (2)","3397011832 (2)","3397011832 (2)"]
[null,170,"3295505412 (4)","3295505412 (4)","3295505412 (4)","3295505412 (4)","3295505412 (4)","3295305032 (4)","3295305032 (4)","3295305032 (4)","3295305032 (4)","3295505932 (4)","3295505932 (4)","3295505932 (4)","3295505932 (4)","3295505932 (4)","3295505932 (4)","3295505932 (4)","3295305512 (4)","3397008372 (2)","3397008372 (2)","3397008372 (2)","3397008372 (2)","3397008372 (2)","3397008372 (2)","3397008372 (2)","3397008372 (2)","3397008372 (2)","3397008372 (2)","3397008372 (2)","3397009062 (2)","3397009062 (2)","3397009062 (2)","3397009062 (2)","3397009062 (2)","3397009062 (2)","3397009062 (2)","3397009062 (2)","3397009062 (2)","3397009062 (2)","3397009752 (2)","3397009752 (2)","3397009752 (2)","3397009752 (2)","3397009752 (2)","3397009752 (2)","3397009752 (2)","3397009752 (2)","3397009752 (2)","3397010442 (2)","3397010442 (2)","3397010442 (2)","3397010442 (2)","3397010442 (2)","3397010442 (2)","3397010442 (2)","3397010442 (2)","3397010442 (2)","3397010442 (2)","3397011132 (2)","3397011132 (2)","3397011132 (2)","3397011132 (2)","3397011132 (2)","3397011132 (2)","3397011132 (2)","3397011132 (2)","3397011132 (2)","3397011832 (2)","3397011832 (2)","3397011832 (2)","3397011832 (2)"]
[null,{"$f":"B68+2","v":172},"3295505412 (4)","3295505412 (4)","3295505412 (4)","3295505412 (4)","3295505412 (4)","3295505412 (4)","3295305032 (4)","3295305032 (4)","3295305032 (4)","3295505932 (4)","3295505932 (4)","3295505932 (4)","3295505932 (4)","3295505932 (4)","3295505932 (4)","3295505932 (4)","3295505932 (4)","3295305512 (4)","3397008372 (2)","3397008372 (2)","3397008372 (2)","3397008372 (2)","3397008372 (2)","3397008372 (2)","3397008372 (2)","3397008372 (2)","3397008372 (2)","3397008372 (2)","3397008372 (2)","3397008372 (2)","3397009062 (2)","3397009062 (2)","3397009062 (2)","3397009062 (2)","3397009062 (2)","3397009062 (2)","3397009062 (2)","3397009062 (2)","3397009062 (2)","3397009752 (2)","3397009752 (2)","3397009752 (2)","3397009752 (2)","3397009752 (2)","3397009752 (2)","3397009752 (2)","3397009752 (2)","3397009752 (2)","3397009752 (2)","3397010442 (2)","3397010442 (2)","3397010442 (2)","3397010442 (2)","3397010442 (2)","3397010442 (2)","3397010442 (2)","3397010442 (2)","3397010442 (2)","3397011132 (2)","3397011132 (2)","3397011132 (2)","3397011132 (2)","3397011132 (2)","3397011132 (2)","3397011132 (2)","3397011132 (2)","3397011132 (2)","3397011132 (2)","3397011832 (2)","3397011832 (2)"]
[null,174,"3295505412 (4)","3295505412 (4)","3295505412 (4)","3295505412 (4)","3295505412 (4)","3295505412 (4)","3295505412 (4)","3295505412 (4)","3295305032 (4)","3295505932 (4)","3295505932 (4)","3295505932 (4)","3295505932 (4)","3295505932 (4)","3295505932 (4)","3295505932 (4)","3295505932 (4)","3295505932 (4)","3295505932 (4)","3295506462 (4)","3397008372 (2)","3397008372 (2)","3397008372 (2)","3397008372 (2)","3397008372 (2)","3397008372 (2)","3397008372 (2)","3397008372 (2)","3397008372 (2)","3397008372 (2)","3397008372 (2)","3397009062 (2)","3397009062 (2)","3397009062 (2)","3397009062 (2)","3397009062 (2)","3397009062 (2)","3397009062 (2)","3397009062 (2)","3397009062 (2)","3397009062 (2)","3397009752 (2)","3397009752 (2)","3397009752 (2)","3397009752 (2)","3397009752 (2)","3397009752 (2)","3397009752 (2)","3397009752 (2)","3397009752 (2)","3397010442 (2)","3397010442 (2)","3397010442 (2)","3397010442 (2)","3397010442 (2)","3397010442 (2)","3397010442 (2)","3397010442 (2)","3397010442 (2)","3397010442 (2)","3397011132 (2)","3397011132 (2)","3397011132 (2)","3397011132 (2)","3397011132 (2)","3397011132 (2)","3397011132 (2)","3397011132 (2)","3397011132 (2)","3397011832 (2)"]
[null,176,"3295505412 (4)","3295505412 (4)","3295505412 (4)","3295505412 (4)","3295505412 (4)","3295505412 (4)","3295505412 (4)","3295505412 (4)","3295505412 (4)","3295505412 (4)","3295505932 (4)","3295505932 (4)","3295505932 (4)","3295505932 (4)","3295505932 (4)","3295505932 (4)","3295505932 (4)","3295505932 (4)","3295505932 (4)","3295505932 (4)","3295506462 (4)","3397008372 (2)","3397008372 (2)","3397008372 (2)","3397008372 (2)","3397008372 (2)","3397008372 (2)","3397008372 (2)","3397008372 (2)","3397008372 (2)","3397008372 (2)","3397008372 (2)","3397009062 (2)","3397009062 (2)","3397009062 (2)","3397009062 (2)","3397009062 (2)","3397009062 (2)","3397009062 (2)","3397009062 (2)","3397009062 (2)","3397009752 (2)","3397009752 (2)","3397009752 (2)","3397009752 (2)","3397009752 (2)","3397009752 (2)","3397009752 (2)","3397009752 (2)","3397009752 (2)","3397009752 (2)","3397010442 (2)","3397010442 (2)","3397010442 (2)","3397010442 (2)","3397010442 (2)","3397010442 (2)","3397010442 (2)","3397010442 (2)","3397010442 (2)","3397010442 (2)","3397011132 (2)","3397011132 (2)","3397011132 (2)","3397011132 (2)","3397011132 (2)","3397011132 (2)","3397011132 (2)","3397011132 (2)","3397011132 (2)"]
[null,178,"3295505412 (4)","3295505412 (4)","3295505412 (4)","3295505412 (4)","3295505412 (4)","3295505412 (4)","3295505412 (4)","3295505412 (4)","3295505412 (4)","3295505412 (4)","3295505412 (4)","3295505932 (4)","3295505932 (4)","3295505932 (4)","3295505932 (4)","3295505932 (4)","3295505932 (4)","3295505932 (4)","3295505932 (4)","3295505932 (4)","3295506462 (4)","3295506462 (4)","3397008372 (2)","3397008372 (2)","3397008372 (2)","3397008372 (2)","3397008372 (2)","3397008372 (2)","3397008372 (2)","3397008372 (2)","3397008372 (2)","3397008372 (2)","3397009062 (2)","3397009062 (2)","3397009062 (2)","3397009062 (2)","3397009062 (2)","3397009062 (2)","3397009062 (2)","3397009062 (2)","3397009062 (2)","3295507512 (4)","3397009752 (2)","3397009752 (2)","3397009752 (2)","3397009752 (2)","3397009752 (2)","3397009752 (2)","3397009752 (2)","3397009752 (2)","3397009752 (2)","3295508042 (4)","3397010442 (2)","3397010442 (2)","3397010442 (2)","3397010442 (2)","3397010442 (2)","3397010442 (2)","3397010442 (2)","3397010442 (2)","3397010442 (2)","3295508572 (4)","3397011132 (2)","3397011132 (2)","3397011132 (2)","3397011132 (2)","3397011132 (2)","3397011132 (2)","3397011132 (2)","3397011132 (2)"]
[null,180,"3296007112 (4)","3295505412 (4)","3295505412 (4)","3295505412 (4)","3295505412 (4)","3295505412 (4)","3295505412 (4)","3295505412 (4)","3295505412 (4)","3295505412 (4)","3296008382 (4)","3295505932 (4)","3295505932 (4)","3295505932 (4)","3295505932 (4)","3295505932 (4)","3295505932 (4)","3295505932 (4)","3295505932 (4)","3295505932 (4)","3296009022 (4)","3295506462 (4)","3295506462 (4)","3397008372 (2)","3397008372 (2)","3397008372 (2)","3397008372 (2)","3397008372 (2)","3397008372 (2)","3397008372 (2)","3397008372 (2)","3295506982 (4)","3295506982 (4)","3295506982 (4)","3397009062 (2)","3397009062 (2)","3397009062 (2)","3397009062 (2)","3397009062 (2)","3397009062 (2)","3397009062 (2)","3295507512 (4)","3295507512 (4)","3295507512 (4)","3397009752 (2)","3397009752 (2)","3397009752 (2)","3397009752 (2)","3397009752 (2)","3397009752 (2)","3397009752 (2)","3295508042 (4)","3295508042 (4)","3295508042 (4)","3397010442 (2)","3397010442 (2)","3397010442 (2)","3397010442 (2)","3397010442 (2)","3397010442 (2)","3397010442 (2)","3295508572 (4)","3295508572 (4)","3295508572 (4)","3397011132 (2)","3397011132 (2)","3397011132 (2)","3397011132 (2)","3397011132 (2)","3397011132 (2)"]
[null,182,"3296007112 (4)","3296007112 (4)","3295505412 (4)","3295505412 (4)","3295505412 (4)","3295505412 (4)","3295505412 (4)","3295505412 (4)","3295505412 (4)","3295505412 (4)","3296008382 (4)","3296008382 (4)","3295505932 (4)","3295505932 (4)","3295505932 (4)","3295505932 (4)","3295505932 (4)","3295505932 (4)","3295505932 (4)","3295505932 (4)","3296009022 (4)","3296009022 (4)","3295506462 (4)","3295506462 (4)","3295506462 (4)","3397008372 (2)","3397008372 (2)","3397008372 (2)","3397008372 (2)","3397008372 (2)","3397008372 (2)","3296009662 (4)","3295506982 (4)","3295506982 (4)","3295506982 (4)","3397009062 (2)","3397009062 (2)","3397009062 (2)","3397009062 (2)","3397009062 (2)","3397009062 (2)","3296010942 (4)","3295507512 (4)","3295507512 (4)","3295507512 (4)","3397009752 (2)","3397009752 (2)","3397009752 (2)","3397009752 (2)","3397009752 (2)","3397009752 (2)","3396009112 (4)","3295508042 (4)","3295508042 (4)","3295508042 (4)","3397010442 (2)","3397010442 (2)","3397010442 (2)","3397010442 (2)","3397010442 (2)","3396009612 (4)","3396009612 (4)","3295508572 (4)","3295508572 (4)","3295508572 (4)","3397011132 (2)","3397011132 (2)","3397011132 (2)","3397011132 (2)","3397011132 (2)"]
[null,184,"3296007112 (4)","3296007112 (4)","3296007112 (4)","3295505412 (4)","3295505412 (4)","3295505412 (4)","3295505412 (4)","3295505412 (4)","3295505412 (4)","3295505412 (4)","3296007752 (4)","3296008382 (4)","3296008382 (4)","3295505932 (4)","3295505932 (4)","3295505932 (4)","3295505932 (4)","3295505932 (4)","3295505932 (4)","3295505932 (4)","3296009022 (4)","3296009022 (4)","3296009022 (4)","3295506462 (4)","3295506462 (4)","3295506462 (4)","3397008372 (2)","3397008372 (2)","3397008372 (2)","3397008372 (2)","3397008372 (2)","3296009662 (4)","3296009662 (4)","3295506982 (4)","3295506982 (4)","3295506982 (4)","3397009062 (2)","3397009062 (2)","3397009062 (2)","3397009062 (2)","3397009062 (2)","3296010302 (4)","3296010942 (4)","3295507512 (4)","3295507512 (4)","3295507512 (4)","3295507512 (4)","3397009752 (2)","3397009752 (2)","3397009752 (2)","3397009752 (2)","3396009112 (4)","3396009112 (4)","3295508042 (4)","3295508042 (4)","3295508042 (4)","3295508042 (4)","3397010442 (2)","3397010442 (2)","3397010442 (2)","3396009612 (4)","3396009612 (4)","3396009612 (4)","3295508572 (4)","3295508572 (4)","3295508572 (4)","3295508572 (4)","3397011132 (2)","3397011132 (2)","3397011132 (2)"]
[null,186,"3296007112 (4)","3296007112 (4)","3296007112 (4)","3296007752 (4)","3295505412 (4)","3295505412 (4)","3295505412 (4)","3295505412 (4)","3295505412 (4)","3295505412 (4)","3296007752 (4)","3296008382 (4)","3296008382 (4)","3296008382 (4)","3295505932 (4)","3295505932 (4)","3295505932 (4)","3295505932 (4)","3295505932 (4)","3296009022 (4)","3296009022 (4)","3296009022 (4)","3296009022 (4)","3296009022 (4)","3295506462 (4)","3295506462 (4)","3295506462 (4)","3397008372 (2)","3397008372 (2)","3397008372 (2)","3397008372 (2)","3296009662 (4)","3296009662 (4)","3296009662 (4)","3295506982 (4)","3295506982 (4)","3295506982 (4)","3295506982 (4)","3397009062 (2)","3397009062 (2)","3397009062 (2)","3296010302 (4)","3296010302 (4)","3296010942 (4)","3296010942 (4)","3295507512 (4)","3295507512 (4)","3295507512 (4)","3397009752 (2)","3397009752 (2)","3296010942 (4)","3396009112 (4)","3396009112 (4)","3396009112 (4)","3396009112 (4)","3295508042 (4)","3295508042 (4)","3295508042 (4)","3396009112 (4)","3397010442 (2)","3396009612 (4)","3396009612 (4)","3396009612 (4)","3396009612 (4)","3396009612 (4)","3295508572 (4)","3295508572 (4)","3295508572 (4)","3295508572 (4)","3397011132 (2)"]
[null,188,"3296007112 (4)","3296007112 (4)","3296007112 (4)","3296007112 (4)","3296007752 (4)","3295505412 (4)","3295505412 (4)","3295505412 (4)","3295505412 (4)","3295505412 (4)","3296007752 (4)","3296007752 (4)","3296008382 (4)","3296008382 (4)","3296008382 (4)","3295505932 (4)","3295505932 (4)","3295505932 (4)","3295505932 (4)","3296008382 (4)","3296009022 (4)","3296009022 (4)","3296009022 (4)","3296009022 (4)","3296009022 (4)","3296009022 (4)","3295506462 (4)","3295506462 (4)","3295506462 (4)","3397008372 (2)","3397008372 (2)","3296009662 (4)","3296009662 (4)","3296009662 (4)","3296009662 (4)","3296009662 (4)","3295506982 (4)","3295506982 (4)","3296010302 (4)","3397009062 (2)","3397009062 (2)","3296010302 (4)","3296010302 (4)","3296010302 (4)","3296010302 (4)","3296010942 (4)","3295507512 (4)","3295507512 (4)","3296010942 (4)","3296010942 (4)","3296010942 (4)","3296010942 (4)","3296010942 (4)","3396009112 (4)","3396009112 (4)","3396009112 (4)","3295508042 (4)","3295508042 (4)","3396009112 (4)","3396009112 (4)","3396009112 (4)","3396009612 (4)","3396009612 (4)","3396009612 (4)","3396009612 (4)","3396009612 (4)","3396009612 (4)","3396009612 (4)","3396009612 (4)","3295508572 (4)"]
[null,190,"3296007112 (4)","3296007112 (4)","3296007112 (4)","3296007112 (4)","3296007112 (4)","3296007752 (4)","3295505412 (4)","3295505412 (4)","3295505412 (4)","3295505412 (4)","3296007752 (4)","3296007752 (4)","3296007752 (4)","3296008382 (4)","3296008382 (4)","3296008382 (4)","3295505932 (4)","3295505932 (4)","3295505932 (4)","3296008382 (4)","3296008382 (4)","3296009022 (4)","3296009022 (4)","3296009022 (4)","3296009022 (4)","3296009022 (4)","3296009022 (4)","3295506462 (4)","3295506462 (4)","3296009022 (4)","3397008372 (2)","3296009662 (4)","3296009662 (4)","3296009662 (4)","3296009662 (4)","3296009662 (4)","3296009662 (4)","3295506982 (4)","3296010302 (4)","3296010302 (4)","3296010302 (4)","3296010302 (4)","3296010302 (4)","3296010302 (4)","3296010302 (4)","3296010302 (4)","3296010942 (4)","3295507512 (4)","3296010942 (4)","3296010942 (4)","3296010942 (4)","3296010942 (4)","3296010942 (4)","3296010942 (4)","3396009112 (4)","3396009112 (4)","3396009112 (4)","3396009112 (4)","3396009112 (4)","3396009112 (4)","3396009112 (4)","3396009112 (4)","3396009612 (4)","3396009612 (4)","3396009612 (4)","3396009612 (4)","3396009612 (4)","3396009612 (4)","3396009612 (4)","3396009612 (4)"]
[null,192,"3296007112 (4)","3296007112 (4)","3296007112 (4)","3296007112 (4)","3296007112 (4)","3296007112 (4)","3296007752 (4)","3295505412 (4)","3295505412 (4)","3296007752 (4)","3296007752 (4)","3296007752 (4)","3296007752 (4)","3296007752 (4)","3296008382 (4)","3296008382 (4)","3296008382 (4)","3295505932 (4)","3295505932 (4)","3296008382 (4)","3296008382 (4)","3296008382 (4)","3296008382 (4)","3296009022 (4)","3296009022 (4)","3296009022 (4)","3296009022 (4)","3296009022 (4)","3295506462 (4)","3296009022 (4)","3296009022 (4)","3296009662 (4)","3296009662 (4)","3296009662 (4)","3296009662 (4)","3296009662 (4)","3296009662 (4)","3296009662 (4)","3296009662 (4)","3296010302 (4)","3296010302 (4)","3296010302 (4)","3296010302 (4)","3296010302 (4)","3296010302 (4)","3296010302 (4)","3296010302 (4)","3296010942 (4)","3296010942 (4)","3296010942 (4)","3296010942 (4)","3296010942 (4)","3296010942 (4)","3296010942 (4)","3296010942 (4)","3396009112 (4)","3396009112 (4)","3396009112 (4)","3396009112 (4)","3396009112 (4)","3396009112 (4)","3396009112 (4)","3396009112 (4)","3396009112 (4)","3396009612 (4)","3396009612 (4)","3396009612 (4)","3396009612 (4)","3396009612 (4)","3396009612 (4)"]
[null,194,"3296007112 (4)","3296007112 (4)","3296007112 (4)","3296007112 (4)","3296007112 (4)","3296007112 (4)","3296007112 (4)","3296007752 (4)","3295505412 (4)","3296007752 (4)","3296007752 (4)","3296007752 (4)","3296007752 (4)","3296007752 (4)","3296007752 (4)","3296008382 (4)","3296008382 (4)","3296008382 (4)","3296008382 (4)","3296008382 (4)","3296008382 (4)","3296008382 (4)","3296008382 (4)","3296008382 (4)","3296009022 (4)","3296009022 (4)","3296009022 (4)","3296009022 (4)","3296009022 (4)","3296009022 (4)","3296009022 (4)","3296009022 (4)","3296009662 (4)","3296009662 (4)","3296009662 (4)","3296009662 (4)","3296009662 (4)","3296009662 (4)","3296009662 (4)","3296009662 (4)","3296010302 (4)","3296010302 (4)","3296010302 (4)","3296010302 (4)","3296010302 (4)","3296010302 (4)","3296010302 (4)","3296010302 (4)","3296010302 (4)","3296010942 (4)","3296010942 (4)","3296010942 (4)","3296010942 (4)","3296010942 (4)","3296010942 (4)","3296010942 (4)","3296010942 (4)","3396009112 (4)","3396009112 (4)","3396009112 (4)","3396009112 (4)","3396009112 (4)","3396009112 (4)","3396009112 (4)","3396009112 (4)","3396009612 (4)","3396009612 (4)","3396009612 (4)","3396009612 (4)","3396009612 (4)"]
[null,{"$f":"B80+2","v":196},"3296007112 (4)","3296007112 (4)","3296007112 (4)","3296007112 (4)","3296007112 (4)","3296007112 (4)","3296007112 (4)","3296007112 (4)","3296007752 (4)","3296007752 (4)","3296007752 (4)","3296007752 (4)","3296007752 (4)","3296007752 (4)","3296007752 (4)","3296007752 (4)","3296008382 (4)","3296008382 (4)","3296008382 (4)","3296008382 (4)","3296008382 (4)","3296008382 (4)","3296008382 (4)","3296008382 (4)","3296008382 (4)","3296009022 (4)","3296009022 (4)","3296009022 (4)","3296009022 (4)","3296009022 (4)","3296009022 (4)","3296009022 (4)","3296009022 (4)","3296009662 (4)","3296009662 (4)","3296009662 (4)","3296009662 (4)","3296009662 (4)","3296009662 (4)","3296009662 (4)","3296009662 (4)","3296010302 (4)","3296010302 (4)","3296010302 (4)","3296010302 (4)","3296010302 (4)","3296010302 (4)","3296010302 (4)","3296010302 (4)","3296010302 (4)","3296010942 (4)","3296010942 (4)","3296010942 (4)","3296010942 (4)","3296010942 (4)","3296010942 (4)","3296010942 (4)","3296010942 (4)","3396009112 (4)","3396009112 (4)","3396009112 (4)","3396009112 (4)","3396009112 (4)","3396009112 (4)","3396009112 (4)","3396009112 (4)","3396009112 (4)","3396009612 (4)","3396009612 (4)","3396009612 (4)"]
[null,{"$f":"B81+2","v":198},"3296007112 (4)","3296007112 (4)","3296007112 (4)","3296007112 (4)","3296007112 (4)","3296007112 (4)","3296007112 (4)","3296007112 (4)","3296007112 (4)","3296007752 (4)","3296007752 (4)","3296007752 (4)","3296007752 (4)","3296007752 (4)","3296007752 (4)","3296007752 (4)","3296007752 (4)","3296008382 (4)","3296008382 (4)","3296008382 (4)","3296008382 (4)","3296008382 (4)","3296008382 (4)","3296008382 (4)","3296008382 (4)","3296008382 (4)","3296009022 (4)","3296009022 (4)","3296009022 (4)","3296009022 (4)","3296009022 (4)","3296009022 (4)","3296009022 (4)","3296009022 (4)","3296009662 (4)","3296009662 (4)","3296009662 (4)","3296009662 (4)","3296009662 (4)","3296009662 (4)","3296009662 (4)","3296009662 (4)","3296009662 (4)","3296010302 (4)","3296010302 (4)","3296010302 (4)","3296010302 (4)","3296010302 (4)","3296010302 (4)","3296010302 (4)","3296010302 (4)","3296010942 (4)","3296010942 (4)","3296010942 (4)","3296010942 (4)","3296010942 (4)","3296010942 (4)","3296010942 (4)","3296010942 (4)","3296010942 (4)","3396009112 (4)","3396009112 (4)","3396009112 (4)","3396009112 (4)","3396009112 (4)","3396009112 (4)","3396009112 (4)","3396009112 (4)","3396009612 (4)","3396009612 (4)"]
[null,200,"3296006482 (4)","3296007112 (4)","3296007112 (4)","3296007112 (4)","3296007112 (4)","3296007112 (4)","3296007112 (4)","3296007112 (4)","3296007112 (4)","3296007112 (4)","3296007752 (4)","3296007752 (4)","3296007752 (4)","3296007752 (4)","3296007752 (4)","3296007752 (4)","3296007752 (4)","3296007752 (4)","3296008382 (4)","3296008382 (4)","3296008382 (4)","3296008382 (4)","3296008382 (4)","3296008382 (4)","3296008382 (4)","3296008382 (4)","3296008382 (4)","3296009022 (4)","3296009022 (4)","3296009022 (4)","3296009022 (4)","3296009022 (4)","3296009022 (4)","3296009022 (4)","3296009022 (4)","3296009662 (4)","3296009662 (4)","3296009662 (4)","3296009662 (4)","3296009662 (4)","3296009662 (4)","3296009662 (4)","3296009662 (4)","3296009662 (4)","3296010302 (4)","3296010302 (4)","3296010302 (4)","3296010302 (4)","3296010302 (4)","3296010302 (4)","3296010302 (4)","3296010302 (4)","3296010942 (4)","3296010942 (4)","3296010942 (4)","3296010942 (4)","3296010942 (4)","3296010942 (4)","3296010942 (4)","3296010942 (4)","3296010942 (4)","3396009112 (4)","3396009112 (4)","3396009112 (4)","3396009112 (4)","3396009112 (4)","3396009112 (4)","3396009112 (4)","3396009112 (4)","3396009112 (4)"]
[null,202,"3296006482 (4)","3296006482 (4)","3296007112 (4)","3296007112 (4)","3296007112 (4)","3296007112 (4)","3296007112 (4)","3296007112 (4)","3296007112 (4)","3296007112 (4)","3296007112 (4)","3296007752 (4)","3296007752 (4)","3296007752 (4)","3296007752 (4)","3296007752 (4)","3296007752 (4)","3296007752 (4)","3296007752 (4)","3296008382 (4)","3296008382 (4)","3296008382 (4)","3296008382 (4)","3296008382 (4)","3296008382 (4)","3296008382 (4)","3296008382 (4)","3296008382 (4)","3296009022 (4)","3296009022 (4)","3296009022 (4)","3296009022 (4)","3296009022 (4)","3296009022 (4)","3296009022 (4)","3296009022 (4)","3296009662 (4)","3296009662 (4)","3296009662 (4)","3296009662 (4)","3296009662 (4)","3296009662 (4)","3296009662 (4)","3296009662 (4)","3296009662 (4)","3296010302 (4)","3296010302 (4)","3296010302 (4)","3296010302 (4)","3296010302 (4)","3296010302 (4)","3296010302 (4)","3296010302 (4)","3296010302 (4)","3296010942 (4)","3296010942 (4)","3296010942 (4)","3296010942 (4)","3296010942 (4)","3296010942 (4)","3296010942 (4)","3296010942 (4)","3396009112 (4)","3396009112 (4)","3396009112 (4)","3396009112 (4)","3396009112 (4)","3396009112 (4)","3396009112 (4)","3396009112 (4)"]
[null,204,"3296006482 (4)","3296006482 (4)","3296006482 (4)","3296007112 (4)","3296007112 (4)","3296007112 (4)","3296007112 (4)","3296007112 (4)","3296007112 (4)","3296007112 (4)","3296007112 (4)","3296007752 (4)","3296007752 (4)","3296007752 (4)","3296007752 (4)","3296007752 (4)","3296007752 (4)","3296007752 (4)","3296007752 (4)","3296007752 (4)","3296008382 (4)","3296008382 (4)","3296008382 (4)","3296008382 (4)","3296008382 (4)","3296008382 (4)","3296008382 (4)","3296008382 (4)","3296008382 (4)","3296009022 (4)","3296009022 (4)","3296009022 (4)","3296009022 (4)","3296009022 (4)","3296009022 (4)","3296009022 (4)","3296009022 (4)","3296009022 (4)","3296009662 (4)","3296009662 (4)","3296009662 (4)","3296009662 (4)","3296009662 (4)","3296009662 (4)","3296009662 (4)","3296009662 (4)","3296010302 (4)","3296010302 (4)","3296010302 (4)","3296010302 (4)","3296010302 (4)","3296010302 (4)","3296010302 (4)","3296010302 (4)","3296010302 (4)","3296010942 (4)","3296010942 (4)","3296010942 (4)","3296010942 (4)","3296010942 (4)","3296010942 (4)","3296010942 (4)","3296010942 (4)","3296010942 (4)","3396009112 (4)","3396009112 (4)","3396009112 (4)","3396009112 (4)","3396009112 (4)","3396009112 (4)"]
[null,206,"3296006482 (4)","3296006482 (4)","3296006482 (4)","3296006482 (4)","3296007112 (4)","3296007112 (4)","3296007112 (4)","3296007112 (4)","3296007112 (4)","3296007112 (4)","3296007112 (4)","3296007112 (4)","3296007752 (4)","3296007752 (4)","3296007752 (4)","3296007752 (4)","3296007752 (4)","3296007752 (4)","3296007752 (4)","3296007752 (4)","3296007752 (4)","3296008382 (4)","3296008382 (4)","3296008382 (4)","3296008382 (4)","3296008382 (4)","3296008382 (4)","3296008382 (4)","3296008382 (4)","3296008382 (4)","3296009022 (4)","3296009022 (4)","3296009022 (4)","3296009022 (4)","3296009022 (4)","3296009022 (4)","3296009022 (4)","3296009022 (4)","3296009022 (4)","3296009662 (4)","3296009662 (4)","3296009662 (4)","3296009662 (4)","3296009662 (4)","3296009662 (4)","3296009662 (4)","3296009662 (4)","3296009662 (4)","3296010302 (4)","3296010302 (4)","3296010302 (4)","3296010302 (4)","3296010302 (4)","3296010302 (4)","3296010302 (4)","3296010302 (4)","3296010942 (4)","3296010942 (4)","3296010942 (4)","3296010942 (4)","3296010942 (4)","3296010942 (4)","3296010942 (4)","3296010942 (4)","3296010942 (4)","3396009112 (4)","3396009112 (4)","3396009112 (4)","3396009112 (4)","3396009112 (4)"]
[null,208,"3296006482 (4)","3296006482 (4)","3296006482 (4)","3296006482 (4)","3296007112 (4)","3296007112 (4)","3296007112 (4)","3296007112 (4)","3296007112 (4)","3296007112 (4)","3296007112 (4)","3296007112 (4)","3296007112 (4)","3296007752 (4)","3296007752 (4)","3296007752 (4)","3296007752 (4)","3296007752 (4)","3296007752 (4)","3296007752 (4)","3296007752 (4)","3296007752 (4)","3296008382 (4)","3296008382 (4)","3296008382 (4)","3296008382 (4)","3296008382 (4)","3296008382 (4)","3296008382 (4)","3296008382 (4)","3296008382 (4)","3296009022 (4)","3296009022 (4)","3296009022 (4)","3296009022 (4)","3296009022 (4)","3296009022 (4)","3296009022 (4)","3296009022 (4)","3296009022 (4)","3296009662 (4)","3296009662 (4)","3296009662 (4)","3296009662 (4)","3296009662 (4)","3296009662 (4)","3296009662 (4)","3296009662 (4)","3296009662 (4)","3296010302 (4)","3296010302 (4)","3296010302 (4)","3296010302 (4)","3296010302 (4)","3296010302 (4)","3296010302 (4)","3296010302 (4)","3296010302 (4)","3296010942 (4)","3296010942 (4)","3296010942 (4)","3296010942 (4)","3296010942 (4)","3296010942 (4)","3296010942 (4)","3296010942 (4)","3296010942 (4)","3396009112 (4)","3396009112 (4)","3396009112 (4)"]
[null,210,"3296006482 (4)","3296006482 (4)","3296006482 (4)","3296006482 (4)","3296006482 (4)","3296007112 (4)","3296007112 (4)","3296007112 (4)","3296007112 (4)","3296007112 (4)","3296007112 (4)","3296007112 (4)","3296007112 (4)","3296007112 (4)","3296007752 (4)","3296007752 (4)","3296007752 (4)","3296007752 (4)","3296007752 (4)","3296007752 (4)","3296007752 (4)","3296007752 (4)","3296007752 (4)","3296008382 (4)","3296008382 (4)","3296008382 (4)","3296008382 (4)","3296008382 (4)","3296008382 (4)","3296008382 (4)","3296008382 (4)","3296008382 (4)","3296009022 (4)","3296009022 (4)","3296009022 (4)","3296009022 (4)","3296009022 (4)","3296009022 (4)","3296009022 (4)","3296009022 (4)","3296009022 (4)","3296009662 (4)","3296009662 (4)","3296009662 (4)","3296009662 (4)","3296009662 (4)","3296009662 (4)","3296009662 (4)","3296009662 (4)","3296009662 (4)","3296010302 (4)","3296010302 (4)","3296010302 (4)","3296010302 (4)","3296010302 (4)","3296010302 (4)","3296010302 (4)","3296010302 (4)","3296010302 (4)","3296010942 (4)","3296010942 (4)","3296010942 (4)","3296010942 (4)","3296010942 (4)","3296010942 (4)","3296010942 (4)","3296010942 (4)","3296010942 (4)","3396009112 (4)","3396009112 (4)"]
[null,212,"3296006482 (4)","3296006482 (4)","3296006482 (4)","3296006482 (4)","3296006482 (4)","3296006482 (4)","3296007112 (4)","3296007112 (4)","3296007112 (4)","3296007112 (4)","3296007112 (4)","3296007112 (4)","3296007112 (4)","3296007112 (4)","3296007112 (4)","3296007752 (4)","3296007752 (4)","3296007752 (4)","3296007752 (4)","3296007752 (4)","3296007752 (4)","3296007752 (4)","3296007752 (4)","3296007752 (4)","3296008382 (4)","3296008382 (4)","3296008382 (4)","3296008382 (4)","3296008382 (4)","3296008382 (4)","3296008382 (4)","3296008382 (4)","3296008382 (4)","3296009022 (4)","3296009022 (4)","3296009022 (4)","3296009022 (4)","3296009022 (4)","3296009022 (4)","3296009022 (4)","3296009022 (4)","3296009022 (4)","3296009662 (4)","3296009662 (4)","3296009662 (4)","3296009662 (4)","3296009662 (4)","3296009662 (4)","3296009662 (4)","3296009662 (4)","3296009662 (4)","3296010302 (4)","3296010302 (4)","3296010302 (4)","3296010302 (4)","3296010302 (4)","3296010302 (4)","3296010302 (4)","3296010302 (4)","3296010302 (4)","3296010942 (4)","3296010942 (4)","3296010942 (4)","3296010942 (4)","3296010942 (4)","3296010942 (4)","3296010942 (4)","3296010942 (4)","3296010942 (4)","3396009112 (4)"]
[null,214,"3296006482 (4)","3296006482 (4)","3296006482 (4)","3296006482 (4)","3296006482 (4)","3296006482 (4)","3296006482 (4)","3296007112 (4)","3296007112 (4)","3296007112 (4)","3296007112 (4)","3296007112 (4)","3296007112 (4)","3296007112 (4)","3296007112 (4)","3296007112 (4)","3296007752 (4)","3296007752 (4)","3296007752 (4)","3296007752 (4)","3296007752 (4)","3296007752 (4)","3296007752 (4)","3296007752 (4)","3296007752 (4)","3296008382 (4)","3296008382 (4)","3296008382 (4)","3296008382 (4)","3296008382 (4)","3296008382 (4)","3296008382 (4)","3296008382 (4)","3296008382 (4)","3296009022 (4)","3296009022 (4)","3296009022 (4)","3296009022 (4)","3296009022 (4)","3296009022 (4)","3296009022 (4)","3296009022 (4)","3296009022 (4)","3296009662 (4)","3296009662 (4)","3296009662 (4)","3296009662 (4)","3296009662 (4)","3296009662 (4)","3296009662 (4)","3296009662 (4)","3296009662 (4)","3296010302 (4)","3296010302 (4)","3296010302 (4)","3296010302 (4)","3296010302 (4)","3296010302 (4)","3296010302 (4)","3296010302 (4)","3296010302 (4)","3296010302 (4)","3296010942 (4)","3296010942 (4)","3296010942 (4)","3296010942 (4)","3296010942 (4)","3296010942 (4)","3296010942 (4)","3296010942 (4)"]
[null,216,"3296006482 (4)","3296006482 (4)","3296006482 (4)","3296006482 (4)","3296006482 (4)","3296006482 (4)","3296006482 (4)","3296006482 (4)","3296007112 (4)","3296007112 (4)","3296007112 (4)","3296007112 (4)","3296007112 (4)","3296007112 (4)","3296007112 (4)","3296007112 (4)","3296007112 (4)","3296007752 (4)","3296007752 (4)","3296007752 (4)","3296007752 (4)","3296007752 (4)","3296007752 (4)","3296007752 (4)","3296007752 (4)","3296007752 (4)","3296008382 (4)","3296008382 (4)","3296008382 (4)","3296008382 (4)","3296008382 (4)","3296008382 (4)","3296008382 (4)","3296008382 (4)","3296008382 (4)","3296009022 (4)","3296009022 (4)","3296009022 (4)","3296009022 (4)","3296009022 (4)","3296009022 (4)","3296009022 (4)","3296009022 (4)","3296009022 (4)","3296009662 (4)","3296009662 (4)","3296009662 (4)","3296009662 (4)","3296009662 (4)","3296009662 (4)","3296009662 (4)","3296009662 (4)","3296009662 (4)","3296009662 (4)","3296010302 (4)","3296010302 (4)","3296010302 (4)","3296010302 (4)","3296010302 (4)","3296010302 (4)","3296010302 (4)","3296010302 (4)","3296010302 (4)","3296010942 (4)","3296010942 (4)","3296010942 (4)","3296010942 (4)","3296010942 (4)","3296010942 (4)","3296010942 (4)"]
[null,218,"3296006482 (4)","3296006482 (4)","3296006482 (4)","3296006482 (4)","3296006482 (4)","3296006482 (4)","3296006482 (4)","3296006482 (4)","3296007112 (4)","3296007112 (4)","3296007112 (4)","3296007112 (4)","3296007112 (4)","3296007112 (4)","3296007112 (4)","3296007112 (4)","3296007112 (4)","3296007112 (4)","3296007752 (4)","3296007752 (4)","3296007752 (4)","3296007752 (4)","3296007752 (4)","3296007752 (4)","3296007752 (4)","3296007752 (4)","3296007752 (4)","3296008382 (4)","3296008382 (4)","3296008382 (4)","3296008382 (4)","3296008382 (4)","3296008382 (4)","3296008382 (4)","3296008382 (4)","3296008382 (4)","3296009022 (4)","3296009022 (4)","3296009022 (4)","3296009022 (4)","3296009022 (4)","3296009022 (4)","3296009022 (4)","3296009022 (4)","3296009022 (4)","3296009022 (4)","3296009662 (4)","3296009662 (4)","3296009662 (4)","3296009662 (4)","3296009662 (4)","3296009662 (4)","3296009662 (4)","3296009662 (4)","3296009662 (4)","3296010302 (4)","3296010302 (4)","3296010302 (4)","3296010302 (4)","3296010302 (4)","3296010302 (4)","3296010302 (4)","3296010302 (4)","3296010302 (4)","3296010942 (4)","3296010942 (4)","3296010942 (4)","3296010942 (4)","3296010942 (4)","3296010942 (4)"]
[null,220,"3296006482 (4)","3296006482 (4)","3296006482 (4)","3296006482 (4)","3296006482 (4)","3296006482 (4)","3296006482 (4)","3296006482 (4)","3296006482 (4)","3296007112 (4)","3296007112 (4)","3296007112 (4)","3296007112 (4)","3296007112 (4)","3296007112 (4)","3296007112 (4)","3296007112 (4)","3296007112 (4)","3296007112 (4)","3296007752 (4)","3296007752 (4)","3296007752 (4)","3296007752 (4)","3296007752 (4)","3296007752 (4)","3296007752 (4)","3296007752 (4)","3296007752 (4)","3296008382 (4)","3296008382 (4)","3296008382 (4)","3296008382 (4)","3296008382 (4)","3296008382 (4)","3296008382 (4)","3296008382 (4)","3296008382 (4)","3296009022 (4)","3296009022 (4)","3296009022 (4)","3296009022 (4)","3296009022 (4)","3296009022 (4)","3296009022 (4)","3296009022 (4)","3296009022 (4)","3296009022 (4)","3296009662 (4)","3296009662 (4)","3296009662 (4)","3296009662 (4)","3296009662 (4)","3296009662 (4)","3296009662 (4)","3296009662 (4)","3296009662 (4)","3296010302 (4)","3296010302 (4)","3296010302 (4)","3296010302 (4)","3296010302 (4)","3296010302 (4)","3296010302 (4)","3296010302 (4)","3296010302 (4)","3296010942 (4)","3296010942 (4)","3296010942 (4)","3296010942 (4)","3296010942 (4)"]
[null,222,"3296006482 (4)","3296006482 (4)","3296006482 (4)","3296006482 (4)","3296006482 (4)","3296006482 (4)","3296006482 (4)","3296006482 (4)","3296006482 (4)","3296006482 (4)","3296007112 (4)","3296007112 (4)","3296007112 (4)","3296007112 (4)","3296007112 (4)","3296007112 (4)","3296007112 (4)","3296007112 (4)","3296007112 (4)","3296007752 (4)","3296007752 (4)","3296007752 (4)","3296007752 (4)","3296007752 (4)","3296007752 (4)","3296007752 (4)","3296007752 (4)","3296007752 (4)","3296007752 (4)","3296008382 (4)","3296008382 (4)","3296008382 (4)","3296008382 (4)","3296008382 (4)","3296008382 (4)","3296008382 (4)","3296008382 (4)","3296008382 (4)","3296009022 (4)","3296009022 (4)","3296009022 (4)","3296009022 (4)","3296009022 (4)","3296009022 (4)","3296009022 (4)","3296009022 (4)","3296009022 (4)","3296009022 (4)","3296009662 (4)","3296009662 (4)","3296009662 (4)","3296009662 (4)","3296009662 (4)","3296009662 (4)","3296009662 (4)","3296009662 (4)","3296009662 (4)","3296010302 (4)","3296010302 (4)","3296010302 (4)","3296010302 (4)","3296010302 (4)","3296010302 (4)","3296010302 (4)","3296010302 (4)","3296010302 (4)","3296010302 (4)","3296010942 (4)","3296010942 (4)","3296010942 (4)"]
[null,224,"3296006482 (4)","3296006482 (4)","3296006482 (4)","3296006482 (4)","3296006482 (4)","3296006482 (4)","3296006482 (4)","3296006482 (4)","3296006482 (4)","3296006482 (4)","3296006482 (4)","3296007112 (4)","3296007112 (4)","3296007112 (4)","3296007112 (4)","3296007112 (4)","3296007112 (4)","3296007112 (4)","3296007112 (4)","3296007112 (4)","3296007752 (4)","3296007752 (4)","3296007752 (4)","3296007752 (4)","3296007752 (4)","3296007752 (4)","3296007752 (4)","3296007752 (4)","3296007752 (4)","3296007752 (4)","3296008382 (4)","3296008382 (4)","3296008382 (4)","3296008382 (4)","3296008382 (4)","3296008382 (4)","3296008382 (4)","3296008382 (4)","3296008382 (4)","3296009022 (4)","3296009022 (4)","3296009022 (4)","3296009022 (4)","3296009022 (4)","3296009022 (4)","3296009022 (4)","3296009022 (4)","3296009022 (4)","3296009022 (4)","3296009662 (4)","3296009662 (4)","3296009662 (4)","3296009662 (4)","3296009662 (4)","3296009662 (4)","3296009662 (4)","3296009662 (4)","3296009662 (4)","3296009662 (4)","3296010302 (4)","3296010302 (4)","3296010302 (4)","3296010302 (4)","3296010302 (4)","3296010302 (4)","3296010302 (4)","3296010302 (4)","3296010302 (4)","3296010942 (4)","3296010942 (4)"]
[null,226,"3296006482 (4)","3296006482 (4)","3296006482 (4)","3296006482 (4)","3296006482 (4)","3296006482 (4)","3296006482 (4)","3296006482 (4)","3296006482 (4)","3296006482 (4)","3296006482 (4)","3296007112 (4)","3296007112 (4)","3296007112 (4)","3296007112 (4)","3296007112 (4)","3296007112 (4)","3296007112 (4)","3296007112 (4)","3296007112 (4)","3296007112 (4)","3296007752 (4)","3296007752 (4)","3296007752 (4)","3296007752 (4)","3296007752 (4)","3296007752 (4)","3296007752 (4)","3296007752 (4)","3296007752 (4)","3296007752 (4)","3296008382 (4)","3296008382 (4)","3296008382 (4)","3296008382 (4)","3296008382 (4)","3296008382 (4)","3296008382 (4)","3296008382 (4)","3296008382 (4)","3296009022 (4)","3296009022 (4)","3296009022 (4)","3296009022 (4)","3296009022 (4)","3296009022 (4)","3296009022 (4)","3296009022 (4)","3296009022 (4)","3296009022 (4)","3296009662 (4)","3296009662 (4)","3296009662 (4)","3296009662 (4)","3296009662 (4)","3296009662 (4)","3296009662 (4)","3296009662 (4)","3296009662 (4)","3296010302 (4)","3296010302 (4)","3296010302 (4)","3296010302 (4)","3296010302 (4)","3296010302 (4)","3296010302 (4)","3296010302 (4)","3296010302 (4)","3296010302 (4)","3296010942 (4)"]
[null,228,"3296508382 (4)","3296006482 (4)","3296006482 (4)","3296006482 (4)","3296006482 (4)","3296006482 (4)","3296006482 (4)","3296006482 (4)","3296006482 (4)","3296006482 (4)","3296006482 (4)","3296007112 (4)","3296007112 (4)","3296007112 (4)","3296007112 (4)","3296007112 (4)","3296007112 (4)","3296007112 (4)","3296007112 (4)","3296007112 (4)","3296007112 (4)","3296007752 (4)","3296007752 (4)","3296007752 (4)","3296007752 (4)","3296007752 (4)","3296007752 (4)","3296007752 (4)","3296007752 (4)","3296007752 (4)","3296008382 (4)","3296008382 (4)","3296008382 (4)","3296008382 (4)","3296008382 (4)","3296008382 (4)","3296008382 (4)","3296008382 (4)","3296008382 (4)","3296008382 (4)","3296009022 (4)","3296009022 (4)","3296009022 (4)","3296009022 (4)","3296009022 (4)","3296009022 (4)","3296009022 (4)","3296009022 (4)","3296009022 (4)","3296009022 (4)","3296009662 (4)","3296009662 (4)","3296009662 (4)","3296009662 (4)","3296009662 (4)","3296009662 (4)","3296009662 (4)","3296009662 (4)","3296009662 (4)","3396511372 (4)","3296010302 (4)","3296010302 (4)","3296010302 (4)","3296010302 (4)","3296010302 (4)","3296010302 (4)","3296010302 (4)","3296010302 (4)","3296010302 (4)","3296010302 (4)"]
[null,230,"3296508382 (4)","3296006482 (4)","3296006482 (4)","3296006482 (4)","3296006482 (4)","3296006482 (4)","3296006482 (4)","3296006482 (4)","3296006482 (4)","3296006482 (4)","3296006482 (4)","3296007112 (4)","3296007112 (4)","3296007112 (4)","3296007112 (4)","3296007112 (4)","3296007112 (4)","3296007112 (4)","3296007112 (4)","3296007112 (4)","3296007112 (4)","3296007752 (4)","3296007752 (4)","3296007752 (4)","3296007752 (4)","3296007752 (4)","3296007752 (4)","3296007752 (4)","3296007752 (4)","3296007752 (4)","3296511402 (4)","3296008382 (4)","3296008382 (4)","3296008382 (4)","3296008382 (4)","3296008382 (4)","3296008382 (4)","3296008382 (4)","3296008382 (4)","3296008382 (4)","3296512162 (4)","3296009022 (4)","3296009022 (4)","3296009022 (4)","3296009022 (4)","3296009022 (4)","3296009022 (4)","3296009022 (4)","3296009022 (4)","3296009022 (4)","3396510772 (4)","3296009662 (4)","3296009662 (4)","3296009662 (4)","3296009662 (4)","3296009662 (4)","3296009662 (4)","3296009662 (4)","3296009662 (4)","3396511372 (4)","3396511372 (4)","3296010302 (4)","3296010302 (4)","3296010302 (4)","3296010302 (4)","3296010302 (4)","3296010302 (4)","3296010302 (4)","3296010302 (4)","3296010302 (4)"]
[null,232,"3296508382 (4)","3296508382 (4)","3296006482 (4)","3296006482 (4)","3296006482 (4)","3296006482 (4)","3296006482 (4)","3296006482 (4)","3296006482 (4)","3296006482 (4)","3296006482 (4)","3296509892 (4)","3296007112 (4)","3296007112 (4)","3296007112 (4)","3296007112 (4)","3296007112 (4)","3296007112 (4)","3296007112 (4)","3296007112 (4)","3296007112 (4)","3296510642 (4)","3296007752 (4)","3296007752 (4)","3296007752 (4)","3296007752 (4)","3296007752 (4)","3296007752 (4)","3296007752 (4)","3296007752 (4)","3296511402 (4)","3296511402 (4)","3296008382 (4)","3296008382 (4)","3296008382 (4)","3296008382 (4)","3296008382 (4)","3296008382 (4)","3296008382 (4)","3296008382 (4)","3296512162 (4)","3296512162 (4)","3296009022 (4)","3296009022 (4)","3296009022 (4)","3296009022 (4)","3296009022 (4)","3296009022 (4)","3296009022 (4)","3396510182 (4)","3396510182 (4)","3396510772 (4)","3296009662 (4)","3296009662 (4)","3296009662 (4)","3296009662 (4)","3296009662 (4)","3296009662 (4)","3296009662 (4)","3396511372 (4)","3396511372 (4)","3396511372 (4)","3296010302 (4)","3296010302 (4)","3296010302 (4)","3296010302 (4)","3296010302 (4)","3296010302 (4)","3296010302 (4)","3296010302 (4)"]
[null,234,"3296508382 (4)","3296508382 (4)","3296508382 (4)","3296006482 (4)","3296006482 (4)","3296006482 (4)","3296006482 (4)","3296006482 (4)","3296006482 (4)","3296006482 (4)","3296006482 (4)","3296509132 (4)","3296509892 (4)","3296007112 (4)","3296007112 (4)","3296007112 (4)","3296007112 (4)","3296007112 (4)","3296007112 (4)","3296007112 (4)","3296510642 (4)","3296510642 (4)","3296510642 (4)","3296007752 (4)","3296007752 (4)","3296007752 (4)","3296007752 (4)","3296007752 (4)","3296007752 (4)","3296007752 (4)","3296511402 (4)","3296511402 (4)","3296511402 (4)","3296008382 (4)","3296008382 (4)","3296008382 (4)","3296008382 (4)","3296008382 (4)","3296008382 (4)","3296008382 (4)","3296512162 (4)","3296512162 (4)","3296512162 (4)","3296512162 (4)","3296009022 (4)","3296009022 (4)","3296009022 (4)","3296009022 (4)","3296009022 (4)","3396510182 (4)","3396510182 (4)","3396510182 (4)","3396510772 (4)","3396510772 (4)","3296009662 (4)","3296009662 (4)","3296009662 (4)","3296009662 (4)","3296009662 (4)","3396510772 (4)","3396511372 (4)","3396511372 (4)","3396511372 (4)","3396511372 (4)","3296010302 (4)","3296010302 (4)","3296010302 (4)","3296010302 (4)","3296010302 (4)","3296010302 (4)"]
[null,236,"3296508382 (4)","3296508382 (4)","3296508382 (4)","3296508382 (4)","3296006482 (4)","3296006482 (4)","3296006482 (4)","3296006482 (4)","3296006482 (4)","3296006482 (4)","3296006482 (4)","3296509132 (4)","3296509132 (4)","3296509892 (4)","3296007112 (4)","3296007112 (4)","3296007112 (4)","3296007112 (4)","3296007112 (4)","3296007112 (4)","3296509892 (4)","3296510642 (4)","3296510642 (4)","3296510642 (4)","3296007752 (4)","3296007752 (4)","3296007752 (4)","3296007752 (4)","3296007752 (4)","3296007752 (4)","3296511402 (4)","3296511402 (4)","3296511402 (4)","3296511402 (4)","3296511402 (4)","3296008382 (4)","3296008382 (4)","3296008382 (4)","3296008382 (4)","3296008382 (4)","3296512162 (4)","3296512162 (4)","3296512162 (4)","3296512162 (4)","3296512162 (4)","3296009022 (4)","3296009022 (4)","3296009022 (4)","3296009022 (4)","3396510182 (4)","3396510182 (4)","3396510182 (4)","3396510182 (4)","3396510182 (4)","3396510772 (4)","3296009662 (4)","3296009662 (4)","3296009662 (4)","3296009662 (4)","3396510772 (4)","3396510772 (4)","3396510772 (4)","3396511372 (4)","3396511372 (4)","3396511372 (4)","3296010302 (4)","3296010302 (4)","3296010302 (4)","3396511372 (4)","3396511372 (4)"]
[null,238,"3296508382 (4)","3296508382 (4)","3296508382 (4)","3296508382 (4)","3296508382 (4)","3296006482 (4)","3296006482 (4)","3296006482 (4)","3296006482 (4)","3296006482 (4)","3296006482 (4)","3296509132 (4)","3296509132 (4)","3296509132 (4)","3296509892 (4)","3296007112 (4)","3296007112 (4)","3296007112 (4)","3296007112 (4)","3296007112 (4)","3296509892 (4)","3296509892 (4)","3296510642 (4)","3296510642 (4)","3296510642 (4)","3296007752 (4)","3296007752 (4)","3296007752 (4)","3296007752 (4)","3296007752 (4)","3296511402 (4)","3296511402 (4)","3296511402 (4)","3296511402 (4)","3296511402 (4)","3296511402 (4)","3296008382 (4)","3296008382 (4)","3296008382 (4)","3296512162 (4)","3296512162 (4)","3296512162 (4)","3296512162 (4)","3296512162 (4)","3296512162 (4)","3296512162 (4)","3296009022 (4)","3296009022 (4)","3296009022 (4)","3396510182 (4)","3396510182 (4)","3396510182 (4)","3396510182 (4)","3396510182 (4)","3396510182 (4)","3396510772 (4)","3296009662 (4)","3296009662 (4)","3296009662 (4)","3396510772 (4)","3396510772 (4)","3396510772 (4)","3396510772 (4)","3396511372 (4)","3396511372 (4)","3396511372 (4)","3296010302 (4)","3296010302 (4)","3396511372 (4)","3396511372 (4)"]
[null,240,"3296508382 (4)","3296508382 (4)","3296508382 (4)","3296508382 (4)","3296508382 (4)","3296006482 (4)","3296006482 (4)","3296006482 (4)","3296006482 (4)","3296006482 (4)","3296509132 (4)","3296509132 (4)","3296509132 (4)","3296509132 (4)","3296509132 (4)","3296509892 (4)","3296007112 (4)","3296007112 (4)","3296007112 (4)","3296007112 (4)","3296509892 (4)","3296509892 (4)","3296509892 (4)","3296510642 (4)","3296510642 (4)","3296510642 (4)","3296007752 (4)","3296007752 (4)","3296007752 (4)","3296007752 (4)","3296510642 (4)","3296511402 (4)","3296511402 (4)","3296511402 (4)","3296511402 (4)","3296511402 (4)","3296511402 (4)","3296008382 (4)","3296008382 (4)","3296512162 (4)","3296512162 (4)","3296512162 (4)","3296512162 (4)","3296512162 (4)","3296512162 (4)","3296512162 (4)","3296512162 (4)","3296009022 (4)","3296009022 (4)","3396510182 (4)","3396510182 (4)","3396510182 (4)","3396510182 (4)","3396510182 (4)","3396510182 (4)","3396510182 (4)","3396510772 (4)","3296009662 (4)","3296009662 (4)","3396510772 (4)","3396510772 (4)","3396510772 (4)","3396510772 (4)","3396510772 (4)","3396511372 (4)","3396511372 (4)","3396511372 (4)","3396511372 (4)","3396511372 (4)","3396511372 (4)"]
[null,242,"3296508382 (4)","3296508382 (4)","3296508382 (4)","3296508382 (4)","3296508382 (4)","3296508382 (4)","3296006482 (4)","3296006482 (4)","3296006482 (4)","3296006482 (4)","3296509132 (4)","3296509132 (4)","3296509132 (4)","3296509132 (4)","3296509132 (4)","3296509892 (4)","3296509892 (4)","3296007112 (4)","3296007112 (4)","3296007112 (4)","3296509892 (4)","3296509892 (4)","3296509892 (4)","3296509892 (4)","3296510642 (4)","3296510642 (4)","3296510642 (4)","3296007752 (4)","3296007752 (4)","3296007752 (4)","3296510642 (4)","3296510642 (4)","3296511402 (4)","3296511402 (4)","3296511402 (4)","3296511402 (4)","3296511402 (4)","3296511402 (4)","3296008382 (4)","3296511402 (4)","3296512162 (4)","3296512162 (4)","3296512162 (4)","3296512162 (4)","3296512162 (4)","3296512162 (4)","3296512162 (4)","3296512162 (4)","3296009022 (4)","3396510182 (4)","3396510182 (4)","3396510182 (4)","3396510182 (4)","3396510182 (4)","3396510182 (4)","3396510182 (4)","3396510182 (4)","3396510772 (4)","3396510772 (4)","3396510772 (4)","3396510772 (4)","3396510772 (4)","3396510772 (4)","3396510772 (4)","3396510772 (4)","3396511372 (4)","3396511372 (4)","3396511372 (4)","3396511372 (4)","3396511372 (4)"]
[null,244,"3296508382 (4)","3296508382 (4)","3296508382 (4)","3296508382 (4)","3296508382 (4)","3296508382 (4)","3296508382 (4)","3296006482 (4)","3296006482 (4)","3296006482 (4)","3296509132 (4)","3296509132 (4)","3296509132 (4)","3296509132 (4)","3296509132 (4)","3296509132 (4)","3296509892 (4)","3296509892 (4)","3296007112 (4)","3296007112 (4)","3296509892 (4)","3296509892 (4)","3296509892 (4)","3296509892 (4)","3296509892 (4)","3296510642 (4)","3296510642 (4)","3296510642 (4)","3296007752 (4)","3296007752 (4)","3296510642 (4)","3296510642 (4)","3296510642 (4)","3296511402 (4)","3296511402 (4)","3296511402 (4)","3296511402 (4)","3296511402 (4)","3296511402 (4)","3296511402 (4)","3296511402 (4)","3296512162 (4)","3296512162 (4)","3296512162 (4)","3296512162 (4)","3296512162 (4)","3296512162 (4)","3296512162 (4)","3296512162 (4)","3296512162 (4)","3396510182 (4)","3396510182 (4)","3396510182 (4)","3396510182 (4)","3396510182 (4)","3396510182 (4)","3396510182 (4)","3396510182 (4)","3396510772 (4)","3396510772 (4)","3396510772 (4)","3396510772 (4)","3396510772 (4)","3396510772 (4)","3396510772 (4)","3396510772 (4)","3396511372 (4)","3396511372 (4)","3396511372 (4)","3396511372 (4)"]
[null,246,"3296508382 (4)","3296508382 (4)","3296508382 (4)","3296508382 (4)","3296508382 (4)","3296508382 (4)","3296508382 (4)","3296508382 (4)","3296006482 (4)","3296006482 (4)","3296509132 (4)","3296509132 (4)","3296509132 (4)","3296509132 (4)","3296509132 (4)","3296509132 (4)","3296509132 (4)","3296509892 (4)","3296509892 (4)","3296007112 (4)","3296509892 (4)","3296509892 (4)","3296509892 (4)","3296509892 (4)","3296509892 (4)","3296510642 (4)","3296510642 (4)","3296510642 (4)","3296510642 (4)","3296510642 (4)","3296510642 (4)","3296510642 (4)","3296510642 (4)","3296510642 (4)","3296511402 (4)","3296511402 (4)","3296511402 (4)","3296511402 (4)","3296511402 (4)","3296511402 (4)","3296511402 (4)","3296511402 (4)","3296512162 (4)","3296512162 (4)","3296512162 (4)","3296512162 (4)","3296512162 (4)","3296512162 (4)","3296512162 (4)","3296512162 (4)","3296512162 (4)","3396510182 (4)","3396510182 (4)","3396510182 (4)","3396510182 (4)","3396510182 (4)","3396510182 (4)","3396510182 (4)","3396510182 (4)","3396510772 (4)","3396510772 (4)","3396510772 (4)","3396510772 (4)","3396510772 (4)","3396510772 (4)","3396510772 (4)","3396510772 (4)","3396511372 (4)","3396511372 (4)","3396511372 (4)"]
[null,248,"3296507632 (4)","3296508382 (4)","3296508382 (4)","3296508382 (4)","3296508382 (4)","3296508382 (4)","3296508382 (4)","3296508382 (4)","3296508382 (4)","3296006482 (4)","3296509132 (4)","3296509132 (4)","3296509132 (4)","3296509132 (4)","3296509132 (4)","3296509132 (4)","3296509132 (4)","3296509132 (4)","3296509892 (4)","3296509892 (4)","3296509892 (4)","3296509892 (4)","3296509892 (4)","3296509892 (4)","3296509892 (4)","3296509892 (4)","3296510642 (4)","3296510642 (4)","3296510642 (4)","3296510642 (4)","3296510642 (4)","3296510642 (4)","3296510642 (4)","3296510642 (4)","3296510642 (4)","3296511402 (4)","3296511402 (4)","3296511402 (4)","3296511402 (4)","3296511402 (4)","3296511402 (4)","3296511402 (4)","3296511402 (4)","3296512162 (4)","3296512162 (4)","3296512162 (4)","3296512162 (4)","3296512162 (4)","3296512162 (4)","3296512162 (4)","3296512162 (4)","3296512162 (4)","3396510182 (4)","3396510182 (4)","3396510182 (4)","3396510182 (4)","3396510182 (4)","3396510182 (4)","3396510182 (4)","3396510182 (4)","3396510772 (4)","3396510772 (4)","3396510772 (4)","3396510772 (4)","3396510772 (4)","3396510772 (4)","3396510772 (4)","3396510772 (4)","3396510772 (4)","3396511372 (4)"]
[null,250,"3296507632 (4)","3296508382 (4)","3296508382 (4)","3296508382 (4)","3296508382 (4)","3296508382 (4)","3296508382 (4)","3296508382 (4)","3296508382 (4)","3296508382 (4)","3296509132 (4)","3296509132 (4)","3296509132 (4)","3296509132 (4)","3296509132 (4)","3296509132 (4)","3296509132 (4)","3296509132 (4)","3296509892 (4)","3296509892 (4)","3296509892 (4)","3296509892 (4)","3296509892 (4)","3296509892 (4)","3296509892 (4)","3296509892 (4)","3296509892 (4)","3296510642 (4)","3296510642 (4)","3296510642 (4)","3296510642 (4)","3296510642 (4)","3296510642 (4)","3296510642 (4)","3296510642 (4)","3296510642 (4)","3296511402 (4)","3296511402 (4)","3296511402 (4)","3296511402 (4)","3296511402 (4)","3296511402 (4)","3296511402 (4)","3296511402 (4)","3296512162 (4)","3296512162 (4)","3296512162 (4)","3296512162 (4)","3296512162 (4)","3296512162 (4)","3296512162 (4)","3296512162 (4)","3296512162 (4)","3396510182 (4)","3396510182 (4)","3396510182 (4)","3396510182 (4)","3396510182 (4)","3396510182 (4)","3396510182 (4)","3396510182 (4)","3396510772 (4)","3396510772 (4)","3396510772 (4)","3396510772 (4)","3396510772 (4)","3396510772 (4)","3396510772 (4)","3396510772 (4)","3396510772 (4)"]
[null,252,"3296507632 (4)","3296507632 (4)","3296508382 (4)","3296508382 (4)","3296508382 (4)","3296508382 (4)","3296508382 (4)","3296508382 (4)","3296508382 (4)","3296508382 (4)","3296508382 (4)","3296509132 (4)","3296509132 (4)","3296509132 (4)","3296509132 (4)","3296509132 (4)","3296509132 (4)","3296509132 (4)","3296509132 (4)","3296509892 (4)","3296509892 (4)","3296509892 (4)","3296509892 (4)","3296509892 (4)","3296509892 (4)","3296509892 (4)","3296509892 (4)","3296509892 (4)","3296510642 (4)","3296510642 (4)","3296510642 (4)","3296510642 (4)","3296510642 (4)","3296510642 (4)","3296510642 (4)","3296510642 (4)","3296511402 (4)","3296511402 (4)","3296511402 (4)","3296511402 (4)","3296511402 (4)","3296511402 (4)","3296511402 (4)","3296511402 (4)","3296511402 (4)","3296512162 (4)","3296512162 (4)","3296512162 (4)","3296512162 (4)","3296512162 (4)","3296512162 (4)","3296512162 (4)","3296512162 (4)","3296512162 (4)","3396510182 (4)","3396510182 (4)","3396510182 (4)","3396510182 (4)","3396510182 (4)","3396510182 (4)","3396510182 (4)","3396510182 (4)","3396510772 (4)","3396510772 (4)","3396510772 (4)","3396510772 (4)","3396510772 (4)","3396510772 (4)","3396510772 (4)","3396510772 (4)"]
[null,254,"3296507632 (4)","3296507632 (4)","3296507632 (4)","3296508382 (4)","3296508382 (4)","3296508382 (4)","3296508382 (4)","3296508382 (4)","3296508382 (4)","3296508382 (4)","3296508382 (4)","3296509132 (4)","3296509132 (4)","3296509132 (4)","3296509132 (4)","3296509132 (4)","3296509132 (4)","3296509132 (4)","3296509132 (4)","3296509132 (4)","3296509892 (4)","3296509892 (4)","3296509892 (4)","3296509892 (4)","3296509892 (4)","3296509892 (4)","3296509892 (4)","3296509892 (4)","3296509892 (4)","3296510642 (4)","3296510642 (4)","3296510642 (4)","3296510642 (4)","3296510642 (4)","3296510642 (4)","3296510642 (4)","3296510642 (4)","3296511402 (4)","3296511402 (4)","3296511402 (4)","3296511402 (4)","3296511402 (4)","3296511402 (4)","3296511402 (4)","3296511402 (4)","3296511402 (4)","3296512162 (4)","3296512162 (4)","3296512162 (4)","3296512162 (4)","3296512162 (4)","3296512162 (4)","3296512162 (4)","3296512162 (4)","3296512162 (4)","3396510182 (4)","3396510182 (4)","3396510182 (4)","3396510182 (4)","3396510182 (4)","3396510182 (4)","3396510182 (4)","3396510182 (4)","3396510182 (4)","3396510772 (4)","3396510772 (4)","3396510772 (4)","3396510772 (4)","3396510772 (4)","3396510772 (4)"]
[null,256,"3296507632 (4)","3296507632 (4)","3296507632 (4)","3296508382 (4)","3296508382 (4)","3296508382 (4)","3296508382 (4)","3296508382 (4)","3296508382 (4)","3296508382 (4)","3296508382 (4)","3296508382 (4)","3296509132 (4)","3296509132 (4)","3296509132 (4)","3296509132 (4)","3296509132 (4)","3296509132 (4)","3296509132 (4)","3296509132 (4)","3296509132 (4)","3296509892 (4)","3296509892 (4)","3296509892 (4)","3296509892 (4)","3296509892 (4)","3296509892 (4)","3296509892 (4)","3296509892 (4)","3296509892 (4)","3296510642 (4)","3296510642 (4)","3296510642 (4)","3296510642 (4)","3296510642 (4)","3296510642 (4)","3296510642 (4)","3296510642 (4)","3296511402 (4)","3296511402 (4)","3296511402 (4)","3296511402 (4)","3296511402 (4)","3296511402 (4)","3296511402 (4)","3296511402 (4)","3296511402 (4)","3296512162 (4)","3296512162 (4)","3296512162 (4)","3296512162 (4)","3296512162 (4)","3296512162 (4)","3296512162 (4)","3296512162 (4)","3296512162 (4)","3396510182 (4)","3396510182 (4)","3396510182 (4)","3396510182 (4)","3396510182 (4)","3396510182 (4)","3396510182 (4)","3396510182 (4)","3396510182 (4)","3396510772 (4)","3396510772 (4)","3396510772 (4)","3396510772 (4)","3396510772 (4)"]
[null,258,"3296507632 (4)","3296507632 (4)","3296507632 (4)","3296507632 (4)","3296508382 (4)","3296508382 (4)","3296508382 (4)","3296508382 (4)","3296508382 (4)","3296508382 (4)","3296508382 (4)","3296508382 (4)","3296508382 (4)","3296509132 (4)","3296509132 (4)","3296509132 (4)","3296509132 (4)","3296509132 (4)","3296509132 (4)","3296509132 (4)","3296509132 (4)","3296509132 (4)","3296509892 (4)","3296509892 (4)","3296509892 (4)","3296509892 (4)","3296509892 (4)","3296509892 (4)","3296509892 (4)","3296509892 (4)","3296510642 (4)","3296510642 (4)","3296510642 (4)","3296510642 (4)","3296510642 (4)","3296510642 (4)","3296510642 (4)","3296510642 (4)","3296510642 (4)","3296511402 (4)","3296511402 (4)","3296511402 (4)","3296511402 (4)","3296511402 (4)","3296511402 (4)","3296511402 (4)","3296511402 (4)","3296511402 (4)","3296512162 (4)","3296512162 (4)","3296512162 (4)","3296512162 (4)","3296512162 (4)","3296512162 (4)","3296512162 (4)","3296512162 (4)","3296512162 (4)","3396510182 (4)","3396510182 (4)","3396510182 (4)","3396510182 (4)","3396510182 (4)","3396510182 (4)","3396510182 (4)","3396510182 (4)","3396510182 (4)","3396510772 (4)","3396510772 (4)","3396510772 (4)","3396510772 (4)"]
[null,260,"3296507632 (4)","3296507632 (4)","3296507632 (4)","3296507632 (4)","3296507632 (4)","3296508382 (4)","3296508382 (4)","3296508382 (4)","3296508382 (4)","3296508382 (4)","3296508382 (4)","3296508382 (4)","3296508382 (4)","3296509132 (4)","3296509132 (4)","3296509132 (4)","3296509132 (4)","3296509132 (4)","3296509132 (4)","3296509132 (4)","3296509132 (4)","3296509132 (4)","3296509892 (4)","3296509892 (4)","3296509892 (4)","3296509892 (4)","3296509892 (4)","3296509892 (4)","3296509892 (4)","3296509892 (4)","3296509892 (4)","3296510642 (4)","3296510642 (4)","3296510642 (4)","3296510642 (4)","3296510642 (4)","3296510642 (4)","3296510642 (4)","3296510642 (4)","3296510642 (4)","3296511402 (4)","3296511402 (4)","3296511402 (4)","3296511402 (4)","3296511402 (4)","3296511402 (4)","3296511402 (4)","3296511402 (4)","3296511402 (4)","3296512162 (4)","3296512162 (4)","3296512162 (4)","3296512162 (4)","3296512162 (4)","3296512162 (4)","3296512162 (4)","3296512162 (4)","3396510182 (4)","3396510182 (4)","3396510182 (4)","3396510182 (4)","3396510182 (4)","3396510182 (4)","3396510182 (4)","3396510182 (4)","3396510182 (4)","3396510182 (4)","3396510772 (4)","3396510772 (4)","3396510772 (4)"]
[null,262,"3296507632 (4)","3296507632 (4)","3296507632 (4)","3296507632 (4)","3296507632 (4)","3296508382 (4)","3296508382 (4)","3296508382 (4)","3296508382 (4)","3296508382 (4)","3296508382 (4)","3296508382 (4)","3296508382 (4)","3296508382 (4)","3296509132 (4)","3296509132 (4)","3296509132 (4)","3296509132 (4)","3296509132 (4)","3296509132 (4)","3296509132 (4)","3296509132 (4)","3296509132 (4)","3296509892 (4)","3296509892 (4)","3296509892 (4)","3296509892 (4)","3296509892 (4)","3296509892 (4)","3296509892 (4)","3296509892 (4)","3296509892 (4)","3296510642 (4)","3296510642 (4)","3296510642 (4)","3296510642 (4)","3296510642 (4)","3296510642 (4)","3296510642 (4)","3296510642 (4)","3296510642 (4)","3296511402 (4)","3296511402 (4)","3296511402 (4)","3296511402 (4)","3296511402 (4)","3296511402 (4)","3296511402 (4)","3296511402 (4)","3296511402 (4)","3296512162 (4)","3296512162 (4)","3296512162 (4)","3296512162 (4)","3296512162 (4)","3296512162 (4)",null,"3396510182 (4)","3396510182 (4)","3396510182 (4)","3396510182 (4)","3396510182 (4)","3396510182 (4)","3396510182 (4)","3396510182 (4)","3396510182 (4)","3396510182 (4)","3396510182 (4)","3396510772 (4)","3396510772 (4)"]
[null,264,"3296507632 (4)","3296507632 (4)","3296507632 (4)","3296507632 (4)","3296507632 (4)","3296507632 (4)","3296508382 (4)","3296508382 (4)","3296508382 (4)","3296508382 (4)","3296508382 (4)","3296508382 (4)","3296508382 (4)","3296508382 (4)","3296508382 (4)","3296509132 (4)","3296509132 (4)","3296509132 (4)","3296509132 (4)","3296509132 (4)","3296509132 (4)","3296509132 (4)","3296509132 (4)","3296509132 (4)","3296509892 (4)","3296509892 (4)","3296509892 (4)","3296509892 (4)","3296509892 (4)","3296509892 (4)","3296509892 (4)","3296509892 (4)","3296509892 (4)","3296510642 (4)","3296510642 (4)","3296510642 (4)","3296510642 (4)","3296510642 (4)","3296510642 (4)","3296510642 (4)","3296510642 (4)","3296510642 (4)","3296511402 (4)","3296511402 (4)","3296511402 (4)","3296511402 (4)","3296511402 (4)","3296511402 (4)","3296511402 (4)","3296511402 (4)","3296511402 (4)","3296512162 (4)","3296512162 (4)","3296512162 (4)","3296512162 (4)","3296512162 (4)",null,null,"3396510182 (4)","3396510182 (4)","3396510182 (4)","3396510182 (4)","3396510182 (4)","3396510182 (4)","3396510182 (4)","3396510182 (4)","3396510182 (4)","3396510182 (4)","3396510182 (4)","3396510772 (4)"]
[null,266,"3296507632 (4)","3296507632 (4)","3296507632 (4)","3296507632 (4)","3296507632 (4)","3296507632 (4)","3296507632 (4)","3296508382 (4)","3296508382 (4)","3296508382 (4)","3296508382 (4)","3296508382 (4)","3296508382 (4)","3296508382 (4)","3296508382 (4)","3296508382 (4)","3296509132 (4)","3296509132 (4)","3296509132 (4)","3296509132 (4)","3296509132 (4)","3296509132 (4)","3296509132 (4)","3296509132 (4)","3296509132 (4)","3296509892 (4)","3296509892 (4)","3296509892 (4)","3296509892 (4)","3296509892 (4)","3296509892 (4)","3296509892 (4)","3296509892 (4)","3296509892 (4)","3296510642 (4)","3296510642 (4)","3296510642 (4)","3296510642 (4)","3296510642 (4)","3296510642 (4)","3296510642 (4)","3296510642 (4)","3296510642 (4)","3296511402 (4)","3296511402 (4)","3296511402 (4)","3296511402 (4)","3296511402 (4)","3296511402 (4)","3296511402 (4)","3296511402 (4)","3296511402 (4)","3296512162 (4)","3296512162 (4)","3296512162 (4)","3296512162 (4)",null,null,null,"3396510182 (4)","3396510182 (4)","3396510182 (4)","3396510182 (4)","3396510182 (4)","3396510182 (4)","3396510182 (4)","3396510182 (4)","3396510182 (4)","3396510182 (4)","3396510182 (4)"]
[null,268,"3296507632 (4)","3296507632 (4)","3296507632 (4)","3296507632 (4)","3296507632 (4)","3296507632 (4)","3296507632 (4)","3296508382 (4)","3296508382 (4)","3296508382 (4)","3296508382 (4)","3296508382 (4)","3296508382 (4)","3296508382 (4)","3296508382 (4)","3296508382 (4)","3296509132 (4)","3296509132 (4)","3296509132 (4)","3296509132 (4)","3296509132 (4)","3296509132 (4)","3296509132 (4)","3296509132 (4)","3296509132 (4)","3296509892 (4)","3296509892 (4)","3296509892 (4)","3296509892 (4)","3296509892 (4)","3296509892 (4)","3296509892 (4)","3296509892 (4)","3296509892 (4)","3296509892 (4)","3296510642 (4)","3296510642 (4)","3296510642 (4)","3296510642 (4)","3296510642 (4)","3296510642 (4)","3296510642 (4)","3296510642 (4)","3296510642 (4)","3296511402 (4)","3296511402 (4)","3296511402 (4)","3296511402 (4)","3296511402 (4)","3296511402 (4)","3296511402 (4)","3296511402 (4)","3296511402 (4)","3296512162 (4)","3296512162 (4)","3296512162 (4)",null,null,null,null,null,"3396510182 (4)","3396510182 (4)","3396510182 (4)","3396510182 (4)","3396510182 (4)","3396510182 (4)","3396510182 (4)","3396510182 (4)","3396510182 (4)"]
[null,270,"3296507632 (4)","3296507632 (4)","3296507632 (4)","3296507632 (4)","3296507632 (4)","3296507632 (4)","3296507632 (4)","3296507632 (4)","3296508382 (4)","3296508382 (4)","3296508382 (4)","3296508382 (4)","3296508382 (4)","3296508382 (4)","3296508382 (4)","3296508382 (4)","3296508382 (4)","3296509132 (4)","3296509132 (4)","3296509132 (4)","3296509132 (4)","3296509132 (4)","3296509132 (4)","3296509132 (4)","3296509132 (4)","3296509132 (4)","3296509892 (4)","3296509892 (4)","3296509892 (4)","3296509892 (4)","3296509892 (4)","3296509892 (4)","3296509892 (4)","3296509892 (4)","3296509892 (4)","3296510642 (4)","3296510642 (4)","3296510642 (4)","3296510642 (4)","3296510642 (4)","3296510642 (4)","3296510642 (4)","3296510642 (4)","3296510642 (4)","3296510642 (4)","3296511402 (4)","3296511402 (4)","3296511402 (4)","3296511402 (4)","3296511402 (4)","3296511402 (4)","3296511402 (4)","3296511402 (4)","3296511402 (4)","3296512162 (4)","3296512162 (4)",null,null,null,null,null,null,"3396510182 (4)","3396510182 (4)","3396510182 (4)","3396510182 (4)","3396510182 (4)","3396510182 (4)","3396510182 (4)","3396510182 (4)"]
[null,272,"3296507632 (4)","3296507632 (4)","3296507632 (4)","3296507632 (4)","3296507632 (4)","3296507632 (4)","3296507632 (4)","3296507632 (4)","3296508382 (4)","3296508382 (4)","3296508382 (4)","3296508382 (4)","3296508382 (4)","3296508382 (4)","3296508382 (4)","3296508382 (4)","3296508382 (4)","3296508382 (4)","3296509132 (4)","3296509132 (4)","3296509132 (4)","3296509132 (4)","3296509132 (4)","3296509132 (4)","3296509132 (4)","3296509132 (4)","3296509132 (4)","3296509892 (4)","3296509892 (4)","3296509892 (4)","3296509892 (4)","3296509892 (4)","3296509892 (4)","3296509892 (4)","3296509892 (4)","3296509892 (4)","3296510642 (4)","3296510642 (4)","3296510642 (4)","3296510642 (4)","3296510642 (4)","3296510642 (4)","3296510642 (4)","3296510642 (4)","3296510642 (4)","3296510642 (4)","3296511402 (4)","3296511402 (4)","3296511402 (4)","3296511402 (4)","3296511402 (4)","3296511402 (4)","3296511402 (4)","3296511402 (4)","3296511402 (4)","3296512162 (4)",null,null,null,null,null,null,null,"3396510182 (4)","3396510182 (4)","3396510182 (4)","3396510182 (4)","3396510182 (4)","3396510182 (4)","3396510182 (4)"]
[null,274,"3296507632 (4)","3296507632 (4)","3296507632 (4)","3296507632 (4)","3296507632 (4)","3296507632 (4)","3296507632 (4)","3296507632 (4)","3296507632 (4)","3296508382 (4)","3296508382 (4)","3296508382 (4)","3296508382 (4)","3296508382 (4)","3296508382 (4)","3296508382 (4)","3296508382 (4)","3296508382 (4)","3296509132 (4)","3296509132 (4)","3296509132 (4)","3296509132 (4)","3296509132 (4)","3296509132 (4)","3296509132 (4)","3296509132 (4)","3296509132 (4)","3296509132 (4)","3296509892 (4)","3296509892 (4)","3296509892 (4)","3296509892 (4)","3296509892 (4)","3296509892 (4)","3296509892 (4)","3296509892 (4)","3296509892 (4)","3296510642 (4)","3296510642 (4)","3296510642 (4)","3296510642 (4)","3296510642 (4)","3296510642 (4)","3296510642 (4)","3296510642 (4)","3296510642 (4)","3296511402 (4)","3296511402 (4)","3296511402 (4)","3296511402 (4)","3296511402 (4)","3296511402 (4)","3296511402 (4)","3296511402 (4)","3296511402 (4)","3296511402 (4)",null,null,null,null,null,null,null,null,"3396510182 (4)","3396510182 (4)","3396510182 (4)","3396510182 (4)","3396510182 (4)","3396510182 (4)"]
[null,276,"3296507632 (4)","3296507632 (4)","3296507632 (4)","3296507632 (4)","3296507632 (4)","3296507632 (4)","3296507632 (4)","3296507632 (4)","3296507632 (4)","3296507632 (4)","3296508382 (4)","3296508382 (4)","3296508382 (4)","3296508382 (4)","3296508382 (4)","3296508382 (4)","3296508382 (4)","3296508382 (4)","3296508382 (4)","3296509132 (4)","3296509132 (4)","3296509132 (4)","3296509132 (4)","3296509132 (4)","3296509132 (4)","3296509132 (4)","3296509132 (4)","3296509132 (4)","3296509132 (4)","3296509892 (4)","3296509892 (4)","3296509892 (4)","3296509892 (4)","3296509892 (4)","3296509892 (4)","3296509892 (4)","3296509892 (4)","3296509892 (4)","3296510642 (4)","3296510642 (4)","3296510642 (4)","3296510642 (4)","3296510642 (4)","3296510642 (4)","3296510642 (4)","3296510642 (4)","3296510642 (4)","3296511402 (4)","3296511402 (4)","3296511402 (4)","3296511402 (4)","3296511402 (4)","3296511402 (4)","3296511402 (4)","3296511402 (4)","3296511402 (4)","3296511402 (4)",null,null,null,null,null,null,null,null,"3396510182 (4)","3396510182 (4)","3396510182 (4)","3396510182 (4)","3396510182 (4)"]
[null,278,"3296507632 (4)","3296507632 (4)","3296507632 (4)","3296507632 (4)","3296507632 (4)","3296507632 (4)","3296507632 (4)","3296507632 (4)","3296507632 (4)","3296507632 (4)","3296508382 (4)","3296508382 (4)","3296508382 (4)","3296508382 (4)","3296508382 (4)","3296508382 (4)","3296508382 (4)","3296508382 (4)","3296508382 (4)","3296508382 (4)","3296509132 (4)","3296509132 (4)","3296509132 (4)","3296509132 (4)","3296509132 (4)","3296509132 (4)","3296509132 (4)","3296509132 (4)","3296509132 (4)","3296509892 (4)","3296509892 (4)","3296509892 (4)","3296509892 (4)","3296509892 (4)","3296509892 (4)","3296509892 (4)","3296509892 (4)","3296509892 (4)","3296509892 (4)","3296510642 (4)","3296510642 (4)","3296510642 (4)","3296510642 (4)","3296510642 (4)","3296510642 (4)","3296510642 (4)","3296510642 (4)","3296510642 (4)","3296511402 (4)","3296511402 (4)","3296511402 (4)","3296511402 (4)","3296511402 (4)","3296511402 (4)","3296511402 (4)","3296511402 (4)","3296511402 (4)","3296511402 (4)",null,null,null,null,null,null,null,null,"3396510182 (4)","3396510182 (4)","3396510182 (4)","3396510182 (4)"]
[null,280,"3296507632 (4)","3296507632 (4)","3296507632 (4)","3296507632 (4)","3296507632 (4)","3296507632 (4)","3296507632 (4)","3296507632 (4)","3296507632 (4)","3296507632 (4)","3296507632 (4)","3296508382 (4)","3296508382 (4)","3296508382 (4)","3296508382 (4)","3296508382 (4)","3296508382 (4)","3296508382 (4)","3296508382 (4)","3296508382 (4)","3296508382 (4)","3296509132 (4)","3296509132 (4)","3296509132 (4)","3296509132 (4)","3296509132 (4)","3296509132 (4)","3296509132 (4)","3296509132 (4)","3296509132 (4)","3296509892 (4)","3296509892 (4)","3296509892 (4)","3296509892 (4)","3296509892 (4)","3296509892 (4)","3296509892 (4)","3296509892 (4)","3296509892 (4)","3296509892 (4)","3296510642 (4)","3296510642 (4)","3296510642 (4)","3296510642 (4)","3296510642 (4)","3296510642 (4)","3296510642 (4)","3296510642 (4)","3296510642 (4)","3296511402 (4)","3296511402 (4)","3296511402 (4)","3296511402 (4)","3296511402 (4)","3296511402 (4)","3296511402 (4)","3296511402 (4)","3296511402 (4)","3296511402 (4)",null,null,null,null,null,null,null,null,"3396510182 (4)","3396510182 (4)","3396510182 (4)"]
[null,282,"3296507632 (4)","3296507632 (4)","3296507632 (4)","3296507632 (4)","3296507632 (4)","3296507632 (4)","3296507632 (4)","3296507632 (4)","3296507632 (4)","3296507632 (4)","3296507632 (4)","3296507632 (4)","3296508382 (4)","3296508382 (4)","3296508382 (4)","3296508382 (4)","3296508382 (4)","3296508382 (4)","3296508382 (4)","3296508382 (4)","3296508382 (4)","3296509132 (4)","3296509132 (4)","3296509132 (4)","3296509132 (4)","3296509132 (4)","3296509132 (4)","3296509132 (4)","3296509132 (4)","3296509132 (4)","3296509132 (4)","3296509892 (4)","3296509892 (4)","3296509892 (4)","3296509892 (4)","3296509892 (4)","3296509892 (4)","3296509892 (4)","3296509892 (4)","3296509892 (4)","3296509892 (4)","3296510642 (4)","3296510642 (4)","3296510642 (4)","3296510642 (4)","3296510642 (4)","3296510642 (4)","3296510642 (4)","3296510642 (4)","3296510642 (4)","3296511402 (4)","3296511402 (4)","3296511402 (4)","3296511402 (4)","3296511402 (4)","3296511402 (4)","3296511402 (4)","3296511402 (4)","3296511402 (4)","3296511402 (4)",null,null,null,null,null,null,null,null,"3396510182 (4)","3396510182 (4)"]
[null,284,"3296507632 (4)","3296507632 (4)","3296507632 (4)","3296507632 (4)","3296507632 (4)","3296507632 (4)","3296507632 (4)","3296507632 (4)","3296507632 (4)","3296507632 (4)","3296507632 (4)","3296507632 (4)","3296508382 (4)","3296508382 (4)","3296508382 (4)","3296508382 (4)","3296508382 (4)","3296508382 (4)","3296508382 (4)","3296508382 (4)","3296508382 (4)","3296508382 (4)","3296509132 (4)","3296509132 (4)","3296509132 (4)","3296509132 (4)","3296509132 (4)","3296509132 (4)","3296509132 (4)","3296509132 (4)","3296509132 (4)","3296509892 (4)","3296509892 (4)","3296509892 (4)","3296509892 (4)","3296509892 (4)","3296509892 (4)","3296509892 (4)","3296509892 (4)","3296509892 (4)","3296509892 (4)","3296510642 (4)","3296510642 (4)","3296510642 (4)","3296510642 (4)","3296510642 (4)","3296510642 (4)","3296510642 (4)","3296510642 (4)","3296510642 (4)","3296510642 (4)","3296511402 (4)","3296511402 (4)","3296511402 (4)","3296511402 (4)","3296511402 (4)","3296511402 (4)","3296511402 (4)","3296511402 (4)","3296511402 (4)","3296511402 (4)",null,null,null,null,null,null,null,null,"3396510182 (4)"]
[null,286,"3397008372 (4)","3296507632 (4)","3296507632 (4)","3296507632 (4)","3296507632 (4)","3296507632 (4)","3296507632 (4)","3296507632 (4)","3296507632 (4)","3296507632 (4)","3296507632 (4)","3296507632 (4)","3296508382 (4)","3296508382 (4)","3296508382 (4)","3296508382 (4)","3296508382 (4)","3296508382 (4)","3296508382 (4)","3296508382 (4)","3296508382 (4)","3296509132 (4)","3296509132 (4)","3296509132 (4)","3296509132 (4)","3296509132 (4)","3296509132 (4)","3296509132 (4)","3296509132 (4)","3296509132 (4)","3296509132 (4)","3296509892 (4)","3296509892 (4)","3296509892 (4)","3296509892 (4)","3296509892 (4)","3296509892 (4)","3296509892 (4)","3296509892 (4)","3296509892 (4)","3296509892 (4)","3296510642 (4)","3296510642 (4)","3296510642 (4)","3296510642 (4)","3296510642 (4)","3296510642 (4)","3296510642 (4)","3296510642 (4)","3296510642 (4)","3397011832 (4)","3296511402 (4)","3296511402 (4)","3296511402 (4)","3296511402 (4)","3296511402 (4)","3296511402 (4)","3296511402 (4)","3296511402 (4)","3296511402 (4)","3296511402 (4)","3296511402 (4)"]
[null,288,"3397008372 (4)","3397008372 (4)","3296507632 (4)","3296507632 (4)","3296507632 (4)","3296507632 (4)","3296507632 (4)","3296507632 (4)","3296507632 (4)","3296507632 (4)","3296507632 (4)","3296507632 (4)","3296508382 (4)","3296508382 (4)","3296508382 (4)","3296508382 (4)","3296508382 (4)","3296508382 (4)","3296508382 (4)","3296508382 (4)","3296508382 (4)","3397009752 (4)","3296509132 (4)","3296509132 (4)","3296509132 (4)","3296509132 (4)","3296509132 (4)","3296509132 (4)","3296509132 (4)","3296509132 (4)","3296509132 (4)","3397010442 (4)","3296509892 (4)","3296509892 (4)","3296509892 (4)","3296509892 (4)","3296509892 (4)","3296509892 (4)","3296509892 (4)","3296509892 (4)","3296509892 (4)","3397011132 (4)","3296510642 (4)","3296510642 (4)","3296510642 (4)","3296510642 (4)","3296510642 (4)","3296510642 (4)","3296510642 (4)","3296510642 (4)","3397011832 (4)","3397011832 (4)","3296511402 (4)","3296511402 (4)","3296511402 (4)","3296511402 (4)","3296511402 (4)","3296511402 (4)","3296511402 (4)","3296511402 (4)","3296511402 (4)","3296511402 (4)","3296511402 (4)"]
[null,290,null,"3397008372 (4)","3296507632 (4)","3296507632 (4)","3296507632 (4)","3296507632 (4)","3296507632 (4)","3296507632 (4)","3296507632 (4)","3296507632 (4)","3296507632 (4)","3296507632 (4)","3397008372 (4)","3296508382 (4)","3296508382 (4)","3296508382 (4)","3296508382 (4)","3296508382 (4)","3296508382 (4)","3296508382 (4)","3296508382 (4)","3397009752 (4)","3397009752 (4)","3296509132 (4)","3296509132 (4)","3296509132 (4)","3296509132 (4)","3296509132 (4)","3296509132 (4)","3296509132 (4)","3296509132 (4)","3397010442 (4)","3397010442 (4)","3296509892 (4)","3296509892 (4)","3296509892 (4)","3296509892 (4)","3296509892 (4)","3296509892 (4)","3296509892 (4)","3296509892 (4)","3397011132 (4)","3397011132 (4)","3296510642 (4)","3296510642 (4)","3296510642 (4)","3296510642 (4)","3296510642 (4)","3296510642 (4)","3296510642 (4)","3397011832 (4)","3397011832 (4)","3397011832 (4)","3296511402 (4)","3296511402 (4)","3296511402 (4)","3296511402 (4)","3296511402 (4)","3296511402 (4)","3296511402 (4)","3296511402 (4)","3296511402 (4)","3296511402 (4)","3296511402 (4)"]
[null,292,null,null,"3397008372 (4)","3296507632 (4)","3296507632 (4)","3296507632 (4)","3296507632 (4)","3296507632 (4)","3296507632 (4)","3296507632 (4)","3296507632 (4)","3296507632 (4)","3397008372 (4)","3296508382 (4)","3296508382 (4)","3296508382 (4)","3296508382 (4)","3296508382 (4)","3296508382 (4)","3296508382 (4)","3296508382 (4)","3397009752 (4)","3397009752 (4)","3296509132 (4)","3296509132 (4)","3296509132 (4)","3296509132 (4)","3296509132 (4)","3296509132 (4)","3296509132 (4)","3296509132 (4)","3397010442 (4)","3397010442 (4)","3397010442 (4)","3296509892 (4)","3296509892 (4)","3296509892 (4)","3296509892 (4)","3296509892 (4)","3296509892 (4)","3296509892 (4)","3397011132 (4)","3397011132 (4)","3397011132 (4)","3296510642 (4)","3296510642 (4)","3296510642 (4)","3296510642 (4)","3296510642 (4)","3296510642 (4)","3397011832 (4)","3397011832 (4)","3397011832 (4)","3397011832 (4)","3296511402 (4)","3296511402 (4)","3296511402 (4)","3296511402 (4)","3296511402 (4)","3296511402 (4)","3296511402 (4)","3296511402 (4)","3296511402 (4)","3296511402 (4)","3296511402 (4)"]
[null,294,null,null,"3397008372 (4)","3397008372 (4)","3296507632 (4)","3296507632 (4)","3296507632 (4)","3296507632 (4)","3296507632 (4)","3296507632 (4)","3296507632 (4)","3397008372 (4)","3397008372 (4)","3397008372 (4)","3296508382 (4)","3296508382 (4)","3296508382 (4)","3296508382 (4)","3296508382 (4)","3296508382 (4)","3296508382 (4)","3397009062 (4)","3397009752 (4)","3397009752 (4)","3296509132 (4)","3296509132 (4)","3296509132 (4)","3296509132 (4)","3296509132 (4)","3296509132 (4)","3296509132 (4)","3397010442 (4)","3397010442 (4)","3397010442 (4)","3296509892 (4)","3296509892 (4)","3296509892 (4)","3296509892 (4)","3296509892 (4)","3296509892 (4)","3397011132 (4)","3397011132 (4)","3397011132 (4)","3397011132 (4)","3397011132 (4)","3296510642 (4)","3296510642 (4)","3296510642 (4)","3296510642 (4)","3296510642 (4)","3397011832 (4)","3397011832 (4)","3397011832 (4)","3397011832 (4)","3397011832 (4)","3296511402 (4)","3296511402 (4)","3296511402 (4)","3296511402 (4)","3296511402 (4)","3296511402 (4)","3296511402 (4)","3296511402 (4)","3296511402 (4)","3296511402 (4)","3296511402 (4)"]
[null,296,null,null,null,"3397008372 (4)","3296507632 (4)","3296507632 (4)","3296507632 (4)","3296507632 (4)","3296507632 (4)","3296507632 (4)","3296507632 (4)","3397008372 (4)","3397008372 (4)","3397008372 (4)","3397008372 (4)","3296508382 (4)","3296508382 (4)","3296508382 (4)","3296508382 (4)","3296508382 (4)","3296508382 (4)","3397009062 (4)","3397009062 (4)","3397009752 (4)","3397009752 (4)","3296509132 (4)","3296509132 (4)","3296509132 (4)","3296509132 (4)","3296509132 (4)","3296509132 (4)","3397010442 (4)","3397010442 (4)","3397010442 (4)","3397010442 (4)","3296509892 (4)","3296509892 (4)","3296509892 (4)","3296509892 (4)","3296509892 (4)","3397011132 (4)","3397011132 (4)","3397011132 (4)","3397011132 (4)","3397011132 (4)","3296510642 (4)","3296510642 (4)","3296510642 (4)","3296510642 (4)","3296510642 (4)","3397011832 (4)","3397011832 (4)","3397011832 (4)","3397011832 (4)","3397011832 (4)","3397011832 (4)","3296511402 (4)","3296511402 (4)","3296511402 (4)","3296511402 (4)","3296511402 (4)","3296511402 (4)","3296511402 (4)","3296511402 (4)","3296511402 (4)","3296511402 (4)","3296511402 (4)"]
[null,298,null,null,null,"3397008372 (4)","3397008372 (4)","3296507632 (4)","3296507632 (4)","3296507632 (4)","3296507632 (4)","3296507632 (4)","3296507632 (4)","3397008372 (4)","3397008372 (4)","3397008372 (4)","3397008372 (4)","3296508382 (4)","3296508382 (4)","3296508382 (4)","3296508382 (4)","3296508382 (4)","3296508382 (4)","3397009062 (4)","3397009062 (4)","3397009062 (4)","3397009752 (4)","3397009752 (4)","3296509132 (4)","3296509132 (4)","3296509132 (4)","3296509132 (4)","3296509132 (4)","3397009752 (4)","3397010442 (4)","3397010442 (4)","3397010442 (4)","3397010442 (4)","3296509892 (4)","3296509892 (4)","3296509892 (4)","3296509892 (4)","3397011132 (4)","3397011132 (4)","3397011132 (4)","3397011132 (4)","3397011132 (4)","3397011132 (4)","3296510642 (4)","3296510642 (4)","3296510642 (4)","3296510642 (4)","3397011832 (4)","3397011832 (4)","3397011832 (4)","3397011832 (4)","3397011832 (4)","3397011832 (4)","3397011832 (4)","3296511402 (4)","3296511402 (4)","3296511402 (4)","3296511402 (4)","3296511402 (4)","3296511402 (4)","3296511402 (4)","3296511402 (4)","3296511402 (4)","3296511402 (4)","3296511402 (4)"]
[null,300,null,null,null,null,"3397008372 (4)","3397008372 (4)","3296507632 (4)","3296507632 (4)","3296507632 (4)","3296507632 (4)","3296507632 (4)","3397008372 (4)","3397008372 (4)","3397008372 (4)","3397008372 (4)","3397008372 (4)","3296508382 (4)","3296508382 (4)","3296508382 (4)","3296508382 (4)","3296508382 (4)","3397009062 (4)","3397009062 (4)","3397009062 (4)","3397009752 (4)","3397009752 (4)","3397009752 (4)","3296509132 (4)","3296509132 (4)","3296509132 (4)","3397009752 (4)","3397009752 (4)","3397009752 (4)","3397010442 (4)","3397010442 (4)","3397010442 (4)","3397010442 (4)","3296509892 (4)","3296509892 (4)","3296509892 (4)","3397010442 (4)","3397011132 (4)","3397011132 (4)","3397011132 (4)","3397011132 (4)","3397011132 (4)","3397011132 (4)","3296510642 (4)","3296510642 (4)","3296510642 (4)","3397011832 (4)","3397011832 (4)","3397011832 (4)","3397011832 (4)","3397011832 (4)","3397011832 (4)","3397011832 (4)","3397011832 (4)","3296511402 (4)","3296511402 (4)","3296511402 (4)","3296511402 (4)","3296511402 (4)","3296511402 (4)","3296511402 (4)","3296511402 (4)","3296511402 (4)","3296511402 (4)","3296511402 (4)"]