{"text_format":"1","workbook":"xlsx","n_sheets":5,"sheets":["Spring_Home","X_Spring","SpringCalculation","Date","Matrix"],"not_rendered":{"charts":0,"images":8,"macros":1,"external_links":0,"defined_names":39,"comments":1,"pivot_tables":0},"unopened":[],"bounds":{"document_bytes":16777216,"sheet_cells":100000,"rows_first":2000,"rows_last":500,"rows_between":2000,"halvings":0,"cell_chars":16384,"cell_head_chars":4096},"cells_cut":0,"cells_raw":0,"read":"whole","date_system":"1900"}

{"sheet":"Spring_Home","index":0,"n_rows":39,"n_cols":11,"rows_kept":39,"cut":false,"hidden":false,"merged":[[1,0,1,8]]}
[]
["Spring selection HOME"]
[]
[]
[null,null,"DW",2400,"[mm]",{"$f":"IF(Date!$B$7>Date!B7,Date!B9,\"\")","v":""}]
[null,null,"DH",2000,"[mm]",{"$f":"IF(Date!$B$7>365,Date!B10,\"\")","v":""}]
[null,null,"KG",125,"[kg]",{"$f":"IF(Date!$B$7>365,Date!B11,\"\")","v":""}]
[]
[]
[null,null,"Spring Home-X extension spring"]
[]
[null,null,null,"Art.nb:","Description"]
[null,null,null,{"$f":"IF(AND(KG<=130,DH<3001,DW<5501),VeerX,NOSP)","v":115510},{"$f":"X_Spring!T1","v":"HOME-X Spring SET L=650, 1875_2000 (2,1 / 3,4 / 4,3)"}]
[null,null,null,{"$f":"IF(AND(KG<=130,DH<3001,DW<5501),KabelX,\"-\")","v":"115211-2000"},{"$f":"IF(AND(KG<=130,DH<3001,DW<5501),X_Spring!Q27,\"-\")","v":"HOME Cable set 2 mm for doorheight 2000 mm"}]
[]
[]
[]
[null,null,"Home-F & R torsion spring",null,null,null,null,null,null,null,{"$f":"\"Build-in information \"&SpringCalculation!SC_RESULT_QTY&\" Springs.\"","v":"Build-in information 2 Springs."}]
[]
[null,null,"Lifetime",15000]
{"$rows_left_out":20}
{"sheet":"X_Spring","index":1,"n_rows":55,"n_cols":20,"rows_kept":55,"cut":false,"hidden":true,"merged":[]}
["ITEM","F0 [N]","RS [N/mm]","DH,min","DH,max","SELECT,H","KG@DH","RESULT_ID",null,"Input:",null,null,"Vaste gegevens:",null,null,null,null,null,null,{"$f":"_xlfn.IFNA(VLOOKUP(VeerX,S2:T55,2,0),\"-\")","v":"HOME-X Spring SET L=650, 1875_2000 (2,1 / 3,4 / 4,3)"}]
[115501,38,0.37436507451144224,1751,2000,{"$f":"IF(AND((DH-IF(VOETJE=TRUE,8,0))>=D2,(DH-IF(VOETJE=TRUE,8,0))<=E2),1,0)","v":1},{"$f":"(((C2*VEERWEG)+B2)*CORRECTION_FACTOR)/9.81","v":40.637714686829796},{"$f":"IF(AND(F2=1,G2<=KG_MAX),MAX($H1:H1)+1,0)","v":1},null,"DH",{"$f":"DH","v":2000},null,"CORRECTION",1.08,null,null,null,null,115501,"HOME-X Spring SET L=650, 1875_2000 (2,1 / 3,0 / --)"]
[115502,42,0.43678056600096238,1751,2000,1,47.155861720497384,{"$f":"IF(AND(F3=1,G3<=KG_MAX),MAX($H2:H2)+1,0)","v":2},null,"KG",{"$f":"KG","v":125},null,"KG MAX↑",0.05,null,null,null,null,115502,"HOME-X Spring SET L=650, 1875_2000 (2,3 / 3,0 / --)"]
[115503,45,0.47048149750353424,1751,{"$f":"2000","v":2000},1,50.767803802775347,{"$f":"IF(AND(F4=1,G4<=KG_MAX),MAX($H3:H3)+1,0)","v":3},null,"VOETJE",false,null,null,null,null,null,null,null,115503,"HOME-X Spring SET L=650, 1875_2000 (2,1 / 3,2 / --)"]
[115504,49,0.53289698899305438,1751,2000,1,57.285950836442922,{"$f":"IF(AND(F5=1,G5<=KG_MAX),MAX($H4:H4)+1,0)","v":4},null,"VEERWEG",{"$f":"(DH-231)/2","v":884.5},null,"KG_MAX",{"$f":"KG*(1+KG_MAX_FACTOR)","v":131.25},null,null,null,null,115504,"HOME-X Spring SET L=650, 1875_2000 (2,3 / 3,2 / --)"]
[115505,52,0.59806474373261964,1751,{"$f":"2000","v":2000},1,63.962010917229591,{"$f":"IF(AND(F6=1,G6<=KG_MAX),MAX($H5:H5)+1,0)","v":5},null,null,null,null,null,null,null,null,null,null,115505,"HOME-X Spring SET L=650, 1875_2000 (2,1 / 3,4 / --)"]
[115506,56,0.66048023522213983,1751,2000,1,70.48015795089718,{"$f":"IF(AND(F7=1,G7<=KG_MAX),MAX($H6:H6)+1,0)","v":6},null,null,null,null,null,null,null,null,null,null,115506,"HOME-X Spring SET L=650, 1875_2000 (2,3 / 3,4 / --)"]
[115507,69,0.75112253469365575,1751,{"$f":"2000","v":2000},1,80.737748470077634,{"$f":"IF(AND(F8=1,G8<=KG_MAX),MAX($H7:H7)+1,0)","v":7},null,"Resultaat:",null,null,null,null,null,null,null,null,115507,"HOME-X Spring SET L=650, 1875_2000 (-- / 3,4 / 3,8)"]
[115508,76,0.84395488275165553,1751,2000,1,90.548047023174973,{"$f":"IF(AND(F9=1,G9<=KG_MAX),MAX($H8:H8)+1,0)","v":8},null,"RESULT_ID",{"$f":"MAX(H2:H54)","v":10},null,null,null,null,null,null,null,115508,"HOME-X Spring SET L=650, 1875_2000 (-- / 3,4 / 4,0)"]
[115509,85,0.98942373576900033,1751,{"$f":"2000","v":2000},1,105.70406909589147,{"$f":"IF(AND(F10=1,G10<=KG_MAX),MAX($H9:H9)+1,0)","v":9},null,"SPRING",{"$f":"IF(KG>130,\"NO SPRING!\",IF(RESULT_ID>0,INDEX(A2:A54,MATCH(RESULT_ID,H2:H54,0)),\"NO SPRING!\"))","v":115510},null,null,null,null,null,null,null,115509,"HOME-X Spring SET L=650, 1875_2000 (-- / 3,4 / 4,3)"]
[115510,99,1.1290404318098006,1751,2000,1,120.84068938742409,{"$f":"IF(AND(F11=1,G11<=KG_MAX),MAX($H10:H10)+1,0)","v":10},null,null,null,null,null,null,null,null,null,null,115510,"HOME-X Spring SET L=650, 1875_2000 (2,1 / 3,4 / 4,3)"]
[115511,110,1.3219052912040483,1751,{"$f":"2000","v":2000},1,140.83213542054833,{"$f":"IF(AND(F12=1,G12<=KG_MAX),MAX($H11:H11)+1,0)","v":0},null,null,null,null,null,null,null,null,null,null,115511,"HOME-X Spring SET L=650, 1875_2000 (2,1 / 3,4 / 4,5)"]
[115521,36,0.32076735213339408,2001,2250,0,35.198391518750867,{"$f":"IF(AND(F13=1,G13<=KG_MAX),MAX($H12:H12)+1,0)","v":0},null,"opmerkingen",null,null,null,null,null,null,null,null,115521,"HOME-X Spring SET L=735, 2125_2250 (2,3 / 2,8 / --)"]
[115522,41,0.36262232639019903,2001,2250,0,39.824526351427266,{"$f":"IF(AND(F14=1,G14<=KG_MAX),MAX($H13:H13)+1,0)","v":0},null,{"$f":"B1","v":"F0 [N]"},"Vaste waarde. Eigenschappen van samengestelde veer",null,null,null,null,null,null,null,115522,"HOME-X Spring SET L=735, 2125_2250 (1,9 / 3,2 / --)"]
[115523,45,0.41356240782291931,2001,2250,0,45.225242170940049,{"$f":"IF(AND(F15=1,G15<=KG_MAX),MAX($H14:H14)+1,0)","v":0},null,{"$f":"C1","v":"RS [N/mm]"},"Vaste waarde. Eigenschappen van samengestelde veer",null,null,null,null,null,null,null,115523,"HOME-X Spring SET L=735 (42-48_45-51)"]
[115524,48,0.47366548013596455,2001,2250,0,51.408122992322269,{"$f":"IF(AND(F16=1,G16<=KG_MAX),MAX($H15:H15)+1,0)","v":0},null,{"$f":"F1","v":"SELECT,H"},"Keuze van het hoogte bereik. Het kunststof voetje heeft hier invloed op.",null,null,null,null,null,null,null,115524,"HOME-X Spring SET L=735, 2125_2250 (1,9 / 3,4 / --)"]
[115525,52,0.52460556156868476,2001,2250,0,56.808838811835045,{"$f":"IF(AND(F17=1,G17<=KG_MAX),MAX($H16:H16)+1,0)","v":0},null,null,"Door het voetje verschuift je bereik 8mm",null,null,null,null,null,null,null,115525,"HOME-X Spring SET L=735, 2125_2250 (2,1 / 3,4 / --)"]
[115526,56,0.57978267014220508,2001,2250,0,62.622140008159306,{"$f":"IF(AND(F18=1,G18<=KG_MAX),MAX($H17:H17)+1,0)","v":0},null,{"$f":"G1","v":"KG@DH"},{"$f":"_xlfn.FORMULATEXT(G2)","v":"=(((C2*VEERWEG)+B2)*CORRECTION_FACTOR)/9,81"},null,null,null,null,null,null,null,115526,"HOME-X Spring SET L=735, 2125_2250 (2,3 / 3,4 / --)"]
[115527,69,0.65759055084958584,2001,2250,0,71.629964281811965,{"$f":"IF(AND(F19=1,G19<=KG_MAX),MAX($H18:H18)+1,0)","v":0},null,{"$f":"H1","v":"RESULT_ID"},"Keuze op basis van het gewicht mits het in het hoogte bereik valt.",null,null,null,null,null,null,null,115527,"HOME-X Spring SET L=735, 2125_2250 (-- / 3,4 / 3,8)"]
[115528,78,0.75400174721771673,2001,2250,0,82.00894077953069,{"$f":"IF(AND(F20=1,G20<=KG_MAX),MAX($H19:H19)+1,0)","v":0},null,null,"Max waarde is RESULT_ID. Als KG>130 dan geen veer",null,null,null,null,null,null,null,115527,"HOME-X Spring SET L=735, 2125_2250 (-- / 3,4 / 3,8)"]
{"$rows_left_out":36}
{"sheet":"SpringCalculation","index":2,"n_rows":262,"n_cols":29,"rows_kept":262,"cut":false,"hidden":true,"merged":[]}
[]
[null,"DH",{"$f":"DH","v":2000},"mm",null,"Cable",3,"mm",null,"DRUM","HMA","LMA","REV_S",null,"Di","inactive","art nb",null,"RESULTS","ITEM","QTY","RST","ELT","MIN DW","ZAGEN","MASS"]
[null,null,null,null,null,null,null,null,null,"M76",{"$f":"1.5*25.4","v":38.099999999999994},{"$f":"1.5*25.4","v":38.099999999999994},0,null,50.8,8,329,null,1,{"$f":"_xlfn.IFNA(INDEX(SC_TABLE,MATCH($S3,$W$26:$W$155,0),MATCH(T$2,$B$25:$V$25,0)),NOSP)","v":3296508382},{"$f":"_xlfn.IFNA(INDEX(SC_TABLE,MATCH($S3,$W$26:$W$155,0),MATCH(U$2,$B$25:$V$25,0)),0)","v":2},6.8195790220146231,{"$f":"_xlfn.IFNA(INDEX(SC_TABLE,MATCH($S3,$W$26:$W$155,0),MATCH(W$2,$B$25:$V$25,0)),\"\")","v":26667},{"$f":"_xlfn.IFNA(INDEX(SC_TABLE,MATCH($S3,$W$26:$W$155,0),MATCH(X$2,$B$25:$V$25,0)),0)","v":2138.6545272861904},"Center",11.996916569449523,0,0,0]
[null,"DW",{"$f":"DW","v":2400},"mm",null,"Drum","M102","[-]",null,"M102",{"$f":"2.1875*25.4","v":55.5625},{"$f":"2*25.4","v":50.8},0.75,null,66.674999999999997,7,339,null,2,{"$f":"_xlfn.IFNA(INDEX(SC_TABLE,MATCH($S4,$W$26:$W$155,0),MATCH(T$2,$B$25:$V$25,0)),\"\")","v":3296509132},2,6.9265098683867485,38250,2290.044628289028,"No cut",13.079019687559821,0,0,0]
[null,null,null,null,null,"HMA",{"$f":"INDEX($K$3:$M$4,MATCH($G$4,$J$3:$J$4,0),MATCH($F5,$K$2:$M$2,0))+($G$2/2)","v":57.0625},"mm",null,null,null,null,null,null,null,null,null,null,3,"",0,0,"",0,0,0,0,0,0]
[null,"Weight",{"$f":"KG","v":125},"KG",null,"LMA",{"$f":"INDEX($K$3:$M$4,MATCH($G$4,$J$3:$J$4,0),MATCH($F6,$K$2:$M$2,0))+($G$2/2)","v":52.3},"mm",null,null,null,null,null,null,"draad","Rm",null,null,4,"",0,0,"",0,0,0,0,0,0]
[null,null,null,null,null,"REV_S",{"$f":"INDEX($K$3:$M$4,MATCH($G$4,$J$3:$J$4,0),MATCH($F7,$K$2:$M$2,0))","v":0.75},"rev",null,null,null,null,null,null,5,1660,null,null,5,"",0,0,"",0,0,0,0,0,0]
[null,"Lifetime",{"$f":"O15/1.5","v":10000},"cycles",null,"CCSP",{"$f":"PI()*(G6+G5)*G7","v":257.67931993366034},"mm",null,"SBD-DW",87,"mm",null,null,5.3,1640,null,null,6,"",0,0,"",0,0,0,0,0,0]
[null,null,null,null,null,"CIRF",{"$f":"PI()*G6*2","v":328.61059156549231},"mm",null,"Veerkop",50,"mm/veer",null,null,5.5,1630,null,null,7,"",0,0,"",0,0,0,0,0,0]
[null,"ODW",{"$f":"(303/SC_DH)*SC_W","v":18.9375},"KG",null,null,null,null,null,"4veren beugel",116,"mm",null,null,6,1590,null,null,8,"",0,0,"",0,0,0,0,0,0]
[null,"HMT",{"$f":"SC_W*9.81*G5","v":69972.890625},"Nmm",null,"DH_not_active",113,"mm",null,"extra ruimte",50,"mm/veer",null,null,6.5,1560,null,null,9,"",0,0,"",0,0,0,0,0,0]
[null,"LMT",{"$f":"C10*9.81*G6","v":9716.1305625000005},"Nmm",null,null,null,null,null,null,null,null,null,null,7,1540,null,null,10,"",0,0,"",0,0,0,0,0,0]
[null,null,null,null,null,"SBD torque",{"$f":"21*46.7","v":980.7},"Nmm",null,"No cut",0,"mm",null,null,7.5,1510,null,null,11,"",0,0,"",{"$f":"_xlfn.IFNA(INDEX(SC_TABLE,MATCH($S13,$W$26:$W$155,0),MATCH(X$2,$B$25:$V$25,0)),0)","v":0},0,0,0,0,0]
[null,null,null,null,null,"tol. +",0.75,"turns",null,"Center",150,"mm",null,null,null,null,null,null,12,"",0,0,"",0,0,0,0,0,0]
[null,"RDT",{"$f":"((SC_DH-G8-G11)/G9)+G7","v":5.7082110920536628},"turns",null,"tol. -",0,"turns",null,"Ex_Center",490,"mm",null,"Min. lifetime Step 1",{"$f":"Lifetime","v":15000},"if > …",null,null,13,"",0,0,"",0,0,0,0,0,0]
[null,null,null,null,null,null,null,null,null,null,null,null,null,"Min. lifetime Step 2",{"$f":"O15/1.2","v":12500},"elseif > … else > \"C8\"",null,null,14,"",0,0,"",0,0,0,0,0,0]
[null,"Results",{"$f":"MAX(W26:W155)","v":2},null,null,"No Cut DW",3000,null,null,null,null,null,null,"SELECTED RESULT:",{"$f":"IF(MAX(W3:W22)>=O15,INDEX(T3:T22,MIN(IF(W3:W22>=O15,ROW(W3:W22)-2,\"\"))),IF(MAX(W3:W22)>=O16,INDEX(T3:T22,MIN(IF(W3:W22>=O16,ROW(W3:W22)-2,\"\"))),T3))","v":3296508382},null,{"$f":"SC_RESULT_ITEM&\" (\"&SC_RESULT_QTY&\")\"","v":"3296508382 (2)"},null,15,"",0,0,"",0,0,0,0,0,0]
[null,null,null,null,null,null,null,null,215,null,null,null,null,"SELECTED QTY:",{"$f":"VLOOKUP(SC_RESULT_ITEM,$T$3:$AA$22,2,0)","v":2},null,null,null,16,"",0,0,"",0,0,0,0,0,0]
[null,"Density",10.5,"KG/m²",null,null,null,"No cut",{"$f":"\"L = \"&DW+I18","v":"L = 2615"},null,null,null,null,"SELECTED RST:",{"$f":"IFERROR(ROUND(VLOOKUP(SC_RESULT_ITEM,$T$3:$AA$22,3,0),1),\"\")","v":6.8},null,null,null,17,"",0,0,"",0,0,0,0,0,0]
[null,"Additional",5.5,"KG",null,null,null,"Center",{"$f":"\"L = \"&ROUND((DW+I18)/2,0)&\";L = \"&ROUND((DW+I18)/2,0)","v":"L = 1308;L = 1308"},null,null,null,null,"SELECTED ELT:",{"$f":"VLOOKUP(SC_RESULT_ITEM,$T$3:$AA$22,4,0)","v":26667},null,null,null,18,"",0,0,"",0,0,0,0,0,0]
{"$rows_left_out":243}
{"sheet":"Date","index":3,"n_rows":16,"n_cols":3,"rows_kept":16,"cut":false,"hidden":true,"merged":[]}
[]
["today",{"$f":"TODAY()","v":"2023-02-10"}]
[]
["release date","2023-02-09"]
["expiration date",{"$f":"B4+365","v":"2024-02-09"}]
[]
["days",{"$f":"B2-B4","v":1}]
[]
["warning","This file is more than one year old."]
[null,"Please check if you have the latest version.  "]
[null,"www.doco-international.com/en/support"]
[]
["Versie","V1.1"]
[]
["1.0","2021-03-01","start"]
["1.1","2020-02-09","Kabelset Home-X toegevoegd op verzoek van PM"]

{"sheet":"Matrix","index":4,"n_rows":133,"n_cols":72,"rows_kept":133,"cut":false,"hidden":true,"merged":[]}
[null,null,null,null,null,null,null,null,null,null,null,null,null,null,null,null,null,null,null,null,null,null,null,null,null,null,null,null,null,null,null,null,null,null,null,null,null,null,null,null,null,null,null,null,null,null,null,null,null,null,null,null,null,null,null,null,null,null,null,null,null,null,null,null,null,null,null,null,null,null,null,{"$f":"COLUMN()","v":72}]
[null,"DH-KG",1775,{"$f":"C2+25","v":1800},{"$f":"D2+25","v":1825},1850,1875,1900,1925,1950,1975,2000,2025,2050,2075,2100,2125,2150,2175,2200,2225,2250,2275,2300,2325,2350,2375,2400,2425,2450,2475,2500,2525,2550,2575,2600,2625,2650,2675,2700,2725,2750,2775,2800,2825,2850,2875,{"$f":"AU2+25","v":2900},2925,2950,2975,3000,3025,3050,3075,3100,3125,3150,3175,3200,3225,3250,3275,3300,3325,3350,3375,3400,{"$f":"BP2+25","v":3425},3450,3475,3500]
[null,40,"3295006632 (2)","3295006632 (2)","3295006632 (2)"]
[null,{"$f":"B3+2","v":42},"3295006192 (2)","3295006632 (2)","3295006632 (2)","3295006632 (2)","3295006632 (2)","3295006632 (2)","3295006632 (2)"]
[null,{"$f":"B4+2","v":44},"3295006192 (2)","3295006192 (2)","3295006192 (2)","3295006192 (2)","3295006632 (2)","3295006632 (2)","3295006632 (2)","3295006632 (2)","3295006632 (2)","3295006632 (2)","3295006632 (2)"]
[null,46,"3295005762 (2)","3295005762 (2)","3295006192 (2)","3295006192 (2)","3295006192 (2)","3295006192 (2)","3295006192 (2)","3295006192 (2)","3295006632 (2)","3295006632 (2)","3295006632 (2)","3295006632 (2)","3295006632 (2)","3295006632 (2)","3295006632 (2)"]
[null,48,"3295005762 (2)","3295005762 (2)","3295005762 (2)","3295005762 (2)","3295005762 (2)","3295006192 (2)","3295006192 (2)","3295006192 (2)","3295006192 (2)","3295006192 (2)","3295006192 (2)","3295006192 (2)","3295006632 (2)","3295006632 (2)","3295006632 (2)","3295006632 (2)","3295006632 (2)","3295006632 (2)","3295006632 (2)"]
[null,50,"3295005332 (2)","3295005762 (2)","3295005762 (2)","3295005762 (2)","3295005762 (2)","3295005762 (2)","3295005762 (2)","3295005762 (2)","3295005762 (2)","3295006192 (2)","3295006192 (2)","3295006192 (2)","3295006192 (2)","3295006192 (2)","3295006192 (2)","3295006192 (2)","3295006632 (2)","3295006632 (2)","3295006632 (2)","3295006632 (2)","3295006632 (2)","3295006632 (2)","3295006632 (2)"]
[null,52,"3295005332 (2)","3295005332 (2)","3295005332 (2)","3295005332 (2)","3295005332 (2)","3295005762 (2)","3295005762 (2)","3295005762 (2)","3295005762 (2)","3295005762 (2)","3295005762 (2)","3295005762 (2)","3295006192 (2)","3295006192 (2)","3295006192 (2)","3295006192 (2)","3295006192 (2)","3295006192 (2)","3295006192 (2)","3295006632 (2)","3295006632 (2)","3295006632 (2)","3295006632 (2)","3295006632 (2)","3295006632 (2)","3295006632 (2)","3295006632 (2)"]
[null,54,"3295005332 (2)","3295005332 (2)","3295005332 (2)","3295005332 (2)","3295005332 (2)","3295005332 (2)","3295005332 (2)","3295005332 (2)","3295005762 (2)","3295005762 (2)","3295005762 (2)","3295005762 (2)","3295005762 (2)","3295005762 (2)","3295005762 (2)","3295005762 (2)","3295006192 (2)","3295006192 (2)","3295006192 (2)","3295006192 (2)","3295006192 (2)","3295006192 (2)","3295006192 (2)","3295006632 (2)","3295006632 (2)","3295006632 (2)","3295006632 (2)","3295006632 (2)","3295006632 (2)","3295006632 (2)","3295006632 (2)"]
[null,56,"3295004902 (2)","3295004902 (2)","3295004902 (2)","3295005332 (2)","3295005332 (2)","3295005332 (2)","3295005332 (2)","3295005332 (2)","3295005332 (2)","3295005332 (2)","3295005332 (2)","3295005762 (2)","3295005762 (2)","3295005762 (2)","3295005762 (2)","3295005762 (2)","3295005762 (2)","3295005762 (2)","3295005762 (2)","3295006192 (2)","3295006192 (2)","3295006192 (2)","3295006192 (2)","3295006192 (2)","3295006192 (2)","3295006192 (2)","3295006192 (2)","3295006632 (2)","3295006632 (2)","3295006632 (2)","3295006632 (2)","3295006632 (2)","3295006632 (2)","3295006632 (2)","3295006632 (2)"]
[null,58,"3295004902 (2)","3295004902 (2)","3295004902 (2)","3295004902 (2)","3295004902 (2)","3295004902 (2)","3295005332 (2)","3295005332 (2)","3295005332 (2)","3295005332 (2)","3295005332 (2)","3295005332 (2)","3295005332 (2)","3295005332 (2)","3295005762 (2)","3295005762 (2)","3295005762 (2)","3295005762 (2)","3295005762 (2)","3295005762 (2)","3295005762 (2)","3295005762 (2)","3295005762 (2)","3295006192 (2)","3295006192 (2)","3295006192 (2)","3295006192 (2)","3295006192 (2)","3295006192 (2)","3295006192 (2)","3295006192 (2)","3295006632 (2)","3295006632 (2)","3295006632 (2)","3295006632 (2)","3295006632 (2)","3295006632 (2)","3295006632 (2)","3295006632 (2)"]
[null,60,"3295004482 (2)","3295004902 (2)","3295004902 (2)","3295004902 (2)","3295004902 (2)","3295004902 (2)","3295004902 (2)","3295004902 (2)","3295004902 (2)","3295005332 (2)","3295005332 (2)","3295005332 (2)","3295005332 (2)","3295005332 (2)","3295005332 (2)","3295005332 (2)","3295005332 (2)","3295005332 (2)","3295005762 (2)","3295005762 (2)","3295005762 (2)","3295005762 (2)","3295005762 (2)","3295005762 (2)","3295005762 (2)","3295005762 (2)","3295006192 (2)","3295006192 (2)","3295006192 (2)","3295006192 (2)","3295006192 (2)","3295006192 (2)","3295006192 (2)","3295006192 (2)","3295006192 (2)","3295006632 (2)","3295006632 (2)","3295006632 (2)","3295006632 (2)","3295006632 (2)","3295006632 (2)","3295006632 (2)","3295006632 (2)"]
[null,62,"3295004482 (2)","3295004482 (2)","3295004482 (2)","3295004902 (2)","3295004902 (2)","3295004902 (2)","3295004902 (2)","3295004902 (2)","3295004902 (2)","3295004902 (2)","3295004902 (2)","3295004902 (2)","3295005332 (2)","3295005332 (2)","3295005332 (2)","3295005332 (2)","3295005332 (2)","3295005332 (2)","3295005332 (2)","3295005332 (2)","3295005332 (2)","3295005762 (2)","3295005762 (2)","3295005762 (2)","3295005762 (2)","3295005762 (2)","3295005762 (2)","3295005762 (2)","3295005762 (2)","3295005762 (2)","3295006192 (2)","3295006192 (2)","3295006192 (2)","3295006192 (2)","3295006192 (2)","3295006192 (2)","3295006192 (2)","3295006192 (2)","3295006632 (2)","3295006632 (2)","3295006632 (2)","3295006632 (2)","3295006632 (2)","3295006632 (2)","3295006632 (2)","3295006632 (2)","3295006632 (2)"]
[null,64,"3295004482 (2)","3295004482 (2)","3295004482 (2)","3295004482 (2)","3295004482 (2)","3295004482 (2)","3295004902 (2)","3295004902 (2)","3295004902 (2)","3295004902 (2)","3295004902 (2)","3295004902 (2)","3295004902 (2)","3295004902 (2)","3295004902 (2)","3295005332 (2)","3295005332 (2)","3295005332 (2)","3295005332 (2)","3295005332 (2)","3295005332 (2)","3295005332 (2)","3295005332 (2)","3295005332 (2)","3295005762 (2)","3295005762 (2)","3295005762 (2)","3295005762 (2)","3295005762 (2)","3295005762 (2)","3295005762 (2)","3295005762 (2)","3295005762 (2)","3295006192 (2)","3295006192 (2)","3295006192 (2)","3295006192 (2)","3295006192 (2)","3295006192 (2)","3295006192 (2)","3295006192 (2)","3295006192 (2)","3295006632 (2)","3295006632 (2)","3295006632 (2)","3295006632 (2)","3295006632 (2)","3295006632 (2)","3295006632 (2)","3295006632 (2)","3295006632 (2)"]
[null,66,"3295004482 (2)","3295004482 (2)","3295004482 (2)","3295004482 (2)","3295004482 (2)","3295004482 (2)","3295004482 (2)","3295004482 (2)","3295004482 (2)","3295004902 (2)","3295004902 (2)","3295004902 (2)","3295004902 (2)","3295004902 (2)","3295004902 (2)","3295004902 (2)","3295004902 (2)","3295004902 (2)","3295005332 (2)","3295005332 (2)","3295005332 (2)","3295005332 (2)","3295005332 (2)","3295005332 (2)","3295005332 (2)","3295005332 (2)","3295005332 (2)","3295005762 (2)","3295005762 (2)","3295005762 (2)","3295005762 (2)","3295005762 (2)","3295005762 (2)","3295005762 (2)","3295005762 (2)","3295005762 (2)","3295006192 (2)","3295006192 (2)","3295006192 (2)","3295006192 (2)","3295006192 (2)","3295006192 (2)","3295006192 (2)","3295006192 (2)","3295006192 (2)","3295006192 (2)","3295006632 (2)","3295006632 (2)","3295006632 (2)","3295006632 (2)","3295006632 (2)","3295006632 (2)","3295006632 (2)","3295006632 (2)","3295006632 (2)"]
[null,68,"3295004482 (2)","3295004482 (2)","3295004482 (2)","3295004482 (2)","3295004482 (2)","3295004482 (2)","3295004482 (2)","3295004482 (2)","3295004482 (2)","3295004902 (2)","3295004902 (2)","3295004902 (2)","3295004902 (2)","3295004902 (2)","3295004902 (2)","3295004902 (2)","3295004902 (2)","3295004902 (2)","3295004902 (2)","3295005332 (2)","3295005332 (2)","3295005332 (2)","3295005332 (2)","3295005332 (2)","3295005332 (2)","3295005332 (2)","3295005332 (2)","3295005332 (2)","3295306972 (2)","3295005762 (2)","3295005762 (2)","3295005762 (2)","3295005762 (2)","3295005762 (2)","3295005762 (2)","3295005762 (2)","3295005762 (2)","3295005762 (2)","3295006192 (2)","3295006192 (2)","3295006192 (2)","3295006192 (2)","3295006192 (2)","3295006192 (2)","3295006192 (2)","3295006192 (2)","3295006192 (2)","3295006192 (2)","3295006632 (2)","3295006632 (2)","3295006632 (2)","3295006632 (2)","3295006632 (2)","3295006632 (2)","3295006632 (2)","3295006632 (2)","3295006632 (2)","3295006632 (2)","3295006632 (2)"]
[null,70,"3295305512 (2)","3295305512 (2)","3295004482 (2)","3295004482 (2)","3295004482 (2)","3295004482 (2)","3295004482 (2)","3295004482 (2)","3295004482 (2)","3295306002 (2)","3295306002 (2)","3295306002 (2)","3295004902 (2)","3295004902 (2)","3295004902 (2)","3295004902 (2)","3295004902 (2)","3295004902 (2)","3295306492 (2)","3295306492 (2)","3295306492 (2)","3295306492 (2)","3295005332 (2)","3295005332 (2)","3295005332 (2)","3295005332 (2)","3295005332 (2)","3295005332 (2)","3295306972 (2)","3295306972 (2)","3295306972 (2)","3295306972 (2)","3295005762 (2)","3295005762 (2)","3295005762 (2)","3295005762 (2)","3295005762 (2)","3295307462 (2)","3295307462 (2)","3295307462 (2)","3295307462 (2)","3295307462 (2)","3295006192 (2)","3295006192 (2)","3295006192 (2)","3295006192 (2)","3295307952 (2)","3295307952 (2)","3295307952 (2)","3295307952 (2)","3295006192 (2)","3295006192 (2)","3295006632 (2)","3295006632 (2)","3295006632 (2)","3295006632 (2)","3295006632 (2)","3295006632 (2)","3295006632 (2)","3295006632 (2)","3295006632 (2)","3295006632 (2)","3295006632 (2)"]
[null,72,"3295305032 (2)","3295305032 (2)","3295305512 (2)","3295305512 (2)","3295305512 (2)","3295004482 (2)","3295004482 (2)","3295004482 (2)","3295004482 (2)","3295305512 (2)","3295305512 (2)","3295306002 (2)","3295306002 (2)","3295306002 (2)","3295306002 (2)","3295004902 (2)","3295004902 (2)","3295004902 (2)","3295306002 (2)","3295306002 (2)","3295306492 (2)","3295306492 (2)","3295306492 (2)","3295306492 (2)","3295306492 (2)","3295306492 (2)","3295005332 (2)","3295306492 (2)","3295306972 (2)","3295306972 (2)","3295306972 (2)","3295306972 (2)","3295306972 (2)","3295306972 (2)","3295306972 (2)","3295306972 (2)","3295005762 (2)","3295307462 (2)","3295307462 (2)","3295307462 (2)","3295307462 (2)","3295307462 (2)","3295307462 (2)","3295307462 (2)","3295307462 (2)","3295307952 (2)","3295307952 (2)","3295307952 (2)","3295307952 (2)","3295307952 (2)","3295307952 (2)","3295307952 (2)","3295307952 (2)","3295307952 (2)","3295006192 (2)","3295006192 (2)","3295006192 (2)","3295006632 (2)","3295006632 (2)","3295006632 (2)","3295006632 (2)","3295006632 (2)","3295006632 (2)","3295006632 (2)","3295006632 (2)","3295006632 (2)","3295006632 (2)"]
[null,74,"3295305032 (2)","3295305032 (2)","3295305032 (2)","3295305032 (2)","3295305032 (2)","3295305512 (2)","3295305512 (2)","3295305512 (2)","3295004482 (2)","3295305512 (2)","3295305512 (2)","3295305512 (2)","3295305512 (2)","3295306002 (2)","3295306002 (2)","3295306002 (2)","3295306002 (2)","3295306002 (2)","3295306002 (2)","3295306002 (2)","3295306002 (2)","3295306002 (2)","3295306492 (2)","3295306492 (2)","3295306492 (2)","3295306492 (2)","3295306492 (2)","3295306492 (2)","3295306492 (2)","3295306492 (2)","3295306492 (2)","3295306972 (2)","3295306972 (2)","3295306972 (2)","3295306972 (2)","3295306972 (2)","3295306972 (2)","3295306972 (2)","3295306972 (2)","3295306972 (2)","3295307462 (2)","3295307462 (2)","3295307462 (2)","3295307462 (2)","3295307462 (2)","3295307462 (2)","3295307462 (2)","3295307462 (2)","3295307462 (2)","3295307952 (2)","3295307952 (2)","3295307952 (2)","3295307952 (2)","3295307952 (2)","3295307952 (2)","3295307952 (2)","3295307952 (2)","3295307952 (2)",null,null,null,"3295006632 (2)","3295006632 (2)","3295006632 (2)","3295006632 (2)","3295006632 (2)","3295006632 (2)"]
{"$rows_left_out":113}